program: Orca
programVersion: 4.2.1
elementType: Cl O N N C C C C C C C C C C C C C C C C H H H H H H H H H H H H H H H H H
charge: 0
multiplicity: 1
keywords: wb97x-d3
keywords: def2-TZVPP
keywords: def2/J RIJCOSX GRIDX6 NOFINALGRIDX
keywords: grid4 nofinalgrid
keywords: scfconv7
keywords: smallprint printgap noloewdin
keywords: NOSOSCF
formula: C16H17ClN2O
InChI: InChI=1S/C16H17ClN2O/c1-16(13-4-3-9-18-11-13)10-15(20-19(16)2)12-5-7-14(17)8-6-12/h3-9,11,15H,10H2,1-2H3
37 atoms
Cl -4.672385 -0.34928 -0.036489
O  1.857128 -1.294377 -1.160287
N  2.896094 -0.396128 -0.797906
N  0.328302 2.785271 -1.17775
C  2.463636 0.134578 0.502048
C  1.876924 -1.112543 1.174074
C  1.177719 -1.788354 -0.001643
C  1.389983 1.190956 0.274592
C  3.605275 0.754664 1.296865
C  -0.296541 -1.461176 -0.07926
C  4.145042 -1.139013 -0.780337
C  0.502794 1.537494 1.287428
C  1.259335 1.868258 -0.931438
C  -1.132801 -1.896855 0.944833
C  -0.848052 -0.715285 -1.112932
C  -0.477628 2.481887 1.043982
C  -2.478162 -1.56713 0.96533
C  -2.191783 -0.370119 -1.105385
C  -0.532146 3.068761 -0.208783
C  -2.994897 -0.792241 -0.060963
H  2.682283 -1.738226 1.561903
H  1.209291 -0.904366 2.006433
H  1.299934 -2.875525 0.04656
H  4.363799 0.021335 1.568459
H  3.212885 1.174499 2.222626
H  4.082846 1.564566 0.744631
H  4.291307 -1.593245 -1.758562
H  4.210386 -1.928649 -0.023964
H  4.96799 -0.44393 -0.626267
H  0.558998 1.070246 2.262443
H  1.935009 1.652477 -1.748039
H  -0.732939 -2.496277 1.754356
H  -0.234619 -0.374769 -1.933911
H  -1.190101 2.757209 1.809004
H  -3.109611 -1.907669 1.774416
H  -2.599988 0.226146 -1.909849
H  -1.293363 3.806569 -0.433402
elementType: Cl O N C H
totalener: -1264.88322180 hartree
nucrepener: 1727.63505165 hartree
electener: -2992.51827345 hartree
oneelecener: -5161.04702932 hartree
twoeener: 2168.52875587 hartree
cpcmener: -0.02755991 hartree
kineticenergy: 1260.67668145 hartree
xcener: -100.560766268506 hartree
chargesum: -0.0000000
charge: -0.109263 -0.372003 -0.067306 -0.357518 0.403232 -0.269640 0.276802 -0.067234 -0.281550 0.020492 -0.215389 -0.174821 -0.076693 -0.273994 -0.188367 -0.160829 -0.142947 -0.169857 -0.003745 0.104129 0.099524 0.110451 0.129404 0.103438 0.109921 0.114414 0.113908 0.095980 0.108531 0.144124 0.122273 0.142784 0.148551 0.153037 0.145803 0.138723 0.145635
qa: -0.1093 -0.3720 -0.0673 -0.3575 0.4032 -0.2696 0.2768 -0.0672 -0.2816 0.0205 -0.2154 -0.1748 -0.0767 -0.2740 -0.1884 -0.1608 -0.1429 -0.1699 -0.0037 0.1041 0.0995 0.1105 0.1294 0.1034 0.1099 0.1144 0.1139 0.0960 0.1085 0.1441 0.1223 0.1428 0.1486 0.1530 0.1458 0.1387 0.1456
va: 1.1963 1.9182 2.8330 3.0696 3.7921 3.9592 3.8443 3.6245 3.8675 3.5399 3.9755 3.9922 4.0841 4.0232 3.9534 3.9060 3.9688 3.9963 3.9991 3.7989 1.0160 1.0149 0.9862 0.9988 1.0023 1.0035 1.0018 0.9924 0.9958 1.0067 1.0566 1.0037 1.0191 0.9932 1.0036 1.0093 0.9999
dispcorr: -0.022250543 hartree
energy: -1264.905472346214
dipole: 28.57139 -26.97711 1.59428 -1.43906 0.34983 -1.08923 6.96743 -4.36590 2.60153
magnitude: 3.23977 au
magnitude: 8.23485 debye
