program: Orca
programVersion: 4.2.1
elementType: Cl O N N C C C C C C C C C C C C C C C C H H H H H H H H H H H H H H H H H
charge: 0
multiplicity: 1
keywords: wb97x-d3
keywords: def2-TZVPP
keywords: def2/J RIJCOSX GRIDX6 NOFINALGRIDX
keywords: grid4 nofinalgrid
keywords: scfconv7
keywords: smallprint printgap noloewdin
keywords: NOSOSCF
formula: C16H17ClN2O
InChI: InChI=1S/C16H17ClN2O/c1-16(13-4-3-9-18-11-13)10-15(20-19(16)2)12-5-7-14(17)8-6-12/h3-9,11,15H,10H2,1-2H3
37 atoms
Cl -4.624605 -0.250034 -0.031327
O  1.874126 -1.336477 -1.149084
N  2.892637 -0.407218 -0.799058
N  0.269937 2.726331 -1.184543
C  2.454558 0.122252 0.500307
C  1.902035 -1.13496 1.181826
C  1.193526 -1.815772 0.0150
C  1.352749 1.148809 0.269348
C  3.584989 0.781063 1.27968
C  -0.278348 -1.471752 -0.060998
C  4.157541 -1.12261 -0.782554
C  0.432531 1.452429 1.26679
C  1.226534 1.838476 -0.929787
C  -1.108585 -1.819856 1.0005
C  -0.828661 -0.784148 -1.13519
C  -0.576174 2.363121 1.01263
C  -2.445165 -1.455582 1.017271
C  -2.163872 -0.408686 -1.133683
C  -0.623166 2.964395 -0.233758
C  -2.959655 -0.738703 -0.051157
H  2.72405 -1.74818 1.554202
H  1.245559 -0.940316 2.025913
H  1.307358 -2.903622 0.067788
H  4.037994 1.593803 0.710693
H  4.363797 0.072165 1.558804
H  3.186775 1.207496 2.199974
H  4.965726 -0.410201 -0.630758
H  4.311677 -1.575488 -1.760342
H  4.240578 -1.90967 -0.025504
H  0.482841 0.974286 2.236579
H  1.927136 1.657588 -1.733671
H  -0.70994 -2.370225 1.844598
H  -0.215824 -0.507717 -1.980608
H  -1.31667 2.599062 1.763941
H  -3.071697 -1.721907 1.857483
H  -2.570622 0.142895 -1.970094
H  -1.406843 3.675259 -0.468089
elementType: Cl O N C H
totalener: -1264.88245107 hartree
nucrepener: 1735.92375831 hartree
electener: -3000.80620939 hartree
oneelecener: -5177.61592770 hartree
twoeener: 2176.80971832 hartree
cpcmener: -0.02749404 hartree
kineticenergy: 1260.67811211 hartree
xcener: -100.561700300954 hartree
chargesum: 0.0000000
charge: -0.109823 -0.373356 -0.069111 -0.357979 0.398459 -0.270967 0.277953 -0.063260 -0.282048 0.021248 -0.215634 -0.171641 -0.070371 -0.271325 -0.181415 -0.160682 -0.141708 -0.175758 -0.002417 0.108654 0.100065 0.108853 0.128784 0.113945 0.104333 0.109593 0.108156 0.113879 0.095723 0.144033 0.119831 0.139685 0.145351 0.151192 0.144764 0.138298 0.144697
qa: -0.1098 -0.3734 -0.0691 -0.3580 0.3985 -0.2710 0.2780 -0.0633 -0.2820 0.0212 -0.2156 -0.1716 -0.0704 -0.2713 -0.1814 -0.1607 -0.1417 -0.1758 -0.0024 0.1087 0.1001 0.1089 0.1288 0.1139 0.1043 0.1096 0.1082 0.1139 0.0957 0.1440 0.1198 0.1397 0.1454 0.1512 0.1448 0.1383 0.1447
va: 1.1957 1.9191 2.8291 3.0735 3.7927 3.9687 3.8550 3.6356 3.8659 3.5391 3.9756 3.9894 4.0882 4.0196 3.9423 3.8992 3.9660 3.9872 3.9976 3.7888 1.0164 1.0155 0.9850 1.0035 0.9986 1.0025 0.9961 1.0015 0.9930 1.0072 1.0579 1.0046 1.0219 0.9941 1.0040 1.0093 1.0003
dispcorr: -0.022680583 hartree
energy: -1264.905131656231
dipole: 28.40639 -26.82474 1.58165 -1.65550 0.56100 -1.09450 6.88467 -4.29135 2.59332
magnitude: 3.22876 au
magnitude: 8.20685 debye
