program: Orca
programVersion: 4.2.1
elementType: Cl O N N C C C C C C C C C C C C C C C C H H H H H H H H H H H H H H H H H
charge: 0
multiplicity: 1
keywords: wb97x-d3
keywords: def2-TZVPP
keywords: def2/J RIJCOSX GRIDX6 NOFINALGRIDX
keywords: grid4 nofinalgrid
keywords: scfconv7
keywords: smallprint printgap noloewdin
keywords: NOSOSCF
formula: C16H17ClN2O
InChI: InChI=1S/C16H17ClN2O/c1-16(13-4-3-9-18-11-13)10-15(20-19(16)2)12-5-7-14(17)8-6-12/h3-9,11,15H,10H2,1-2H3
37 atoms
Cl -4.735366 -0.509558 -0.05806
O  1.819979 -1.270131 -1.142523
N  2.891878 -0.415277 -0.79513
N  -0.379331 2.565139 1.063289
C  2.47926 0.156901 0.490251
C  1.859043 -1.058578 1.193361
C  1.159085 -1.758904 0.028805
C  1.438542 1.236966 0.223128
C  3.640768 0.770693 1.261901
C  -0.320709 -1.458919 -0.048017
C  4.115097 -1.197205 -0.780491
C  1.34202 1.887813 -0.999187
C  0.555287 1.639473 1.220847
C  -1.152834 -1.92567 0.96615
C  -0.884398 -0.719695 -1.080308
C  0.366433 2.855527 -1.178658
C  -2.508582 -1.641662 0.97229
C  -2.240062 -0.425166 -1.089091
C  -0.479173 3.150557 -0.123355
C  -3.041601 -0.883747 -0.058838
H  2.647111 -1.687093 1.610877
H  1.184206 -0.811701 2.009412
H  1.297024 -2.844166 0.091585
H  3.266051 1.235823 2.173703
H  4.137445 1.547813 0.679044
H  4.381933 0.028126 1.557361
H  4.961756 -0.529374 -0.633464
H  4.240071 -1.658945 -1.758867
H  4.158417 -1.9870 -0.021676
H  2.010631 1.627925 -1.808383
H  0.599841 1.190401 2.207924
H  -0.742278 -2.516934 1.776763
H  -0.270304 -0.35331 -1.889677
H  0.258662 3.369779 -2.124216
H  -3.138194 -2.006146 1.772874
H  -2.659889 0.16088 -1.895645
H  -1.260535 3.894272 -0.23363
elementType: Cl O N C H
totalener: -1264.88991633 hartree
nucrepener: 1718.40755069 hartree
electener: -2983.29746703 hartree
oneelecener: -5142.67848060 hartree
twoeener: 2159.38101357 hartree
cpcmener: -0.02215611 hartree
kineticenergy: 1260.66565622 hartree
xcener: -100.557914233003 hartree
chargesum: 0.0000000
charge: -0.106164 -0.355374 -0.058980 -0.341139 0.387926 -0.270158 0.271305 -0.054429 -0.283535 0.025567 -0.214626 -0.209004 -0.073636 -0.274404 -0.202277 -0.137780 -0.138741 -0.152778 -0.008040 0.094944 0.098668 0.110116 0.127266 0.109474 0.114088 0.101738 0.106299 0.114330 0.093356 0.141797 0.118183 0.140028 0.148818 0.153239 0.142974 0.137624 0.143326
qa: -0.1062 -0.3554 -0.0590 -0.3411 0.3879 -0.2702 0.2713 -0.0544 -0.2835 0.0256 -0.2146 -0.2090 -0.0736 -0.2744 -0.2023 -0.1378 -0.1387 -0.1528 -0.0080 0.0949 0.0987 0.1101 0.1273 0.1095 0.1141 0.1017 0.1063 0.1143 0.0934 0.1418 0.1182 0.1400 0.1488 0.1532 0.1430 0.1376 0.1433
va: 1.2001 1.9317 2.8405 3.0816 3.8005 3.9492 3.8439 3.5834 3.8716 3.5472 3.9789 3.9678 4.1258 4.0317 3.9762 3.8931 3.9711 3.9858 4.0037 3.8285 1.0161 1.0154 0.9861 1.0025 1.0033 0.9988 0.9963 1.0020 0.9917 1.0420 1.0226 1.0047 1.0169 0.9930 1.0046 1.0088 0.9994
dispcorr: -0.021796664 hartree
energy: -1264.911712996795
dipole: 30.03462 -27.78613 2.24849 -0.47465 -0.28922 -0.76387 3.41210 -2.95250 0.45959
magnitude: 2.41877 au
magnitude: 6.14801 debye
