program: Orca
programVersion: 4.2.1
elementType: Cl O N N C C C C C C C C C C C C C C C C H H H H H H H H H H H H H H H H H
charge: 0
multiplicity: 1
keywords: wb97x-d3
keywords: def2-TZVPP
keywords: def2/J RIJCOSX GRIDX6 NOFINALGRIDX
keywords: grid4 nofinalgrid
keywords: scfconv7
keywords: smallprint printgap noloewdin
keywords: NOSOSCF
formula: C16H17ClN2O
InChI: InChI=1S/C16H17ClN2O/c1-16(13-4-3-9-18-11-13)10-15(20-19(16)2)12-5-7-14(17)8-6-12/h3-9,11,15H,10H2,1-2H3
37 atoms
Cl -5.013433 -1.985824 -0.399966
O  1.722441 -1.624597 -0.49706
N  1.8620 -0.253339 -0.857816
N  0.255905 3.502856 -0.472205
C  2.226699 0.413744 0.406442
C  1.273884 -0.307091 1.387609
C  0.907437 -1.613502 0.650083
C  1.876166 1.882138 0.257984
C  3.677623 0.187478 0.830253
C  -0.567152 -1.711662 0.338497
C  2.828178 -0.19218 -1.926164
C  2.700916 2.912721 0.68642
C  0.657732 2.250953 -0.316751
C  -1.094847 -1.426267 -0.915533
C  -1.437736 -2.092163 1.35644
C  2.288982 4.229361 0.530825
C  -2.461572 -1.506999 -1.146406
C  -2.80383 -2.178499 1.142425
C  1.060875 4.474596 -0.054379
C  -3.306029 -1.881559 -0.115005
H  1.772074 -0.506072 2.335955
H  0.387216 0.285038 1.609274
H  1.197582 -2.486871 1.239506
H  3.851909 0.573789 1.834681
H  4.394056 0.667843 0.162624
H  3.908397 -0.878208 0.857058
H  2.411392 -0.655716 -2.820544
H  3.785559 -0.674438 -1.700744
H  3.015331 0.855606 -2.160489
H  3.661106 2.710767 1.141707
H  -0.024464 1.485358 -0.66942
H  -0.449894 -1.12738 -1.729989
H  -1.048224 -2.331272 2.339559
H  2.913834 5.049049 0.858516
H  -2.858996 -1.278443 -2.126371
H  -3.463806 -2.479145 1.944993
H  0.709284 5.490736 -0.193717
elementType: Cl O N C H
totalener: -1264.89052538 hartree
nucrepener: 1644.66648755 hartree
electener: -2909.55701293 hartree
oneelecener: -4995.01361379 hartree
twoeener: 2085.45660086 hartree
cpcmener: -0.02121310 hartree
kineticenergy: 1260.64615400 hartree
xcener: -100.547979019135 hartree
chargesum: -0.0000000
charge: -0.104115 -0.336042 -0.105179 -0.363657 0.529842 -0.194565 0.279143 -0.224802 -0.384744 0.004583 -0.205472 -0.141410 -0.035661 -0.246558 -0.267914 -0.155345 -0.137235 -0.127310 0.010409 0.085409 0.095196 0.111481 0.120057 0.106230 0.110707 0.112172 0.110543 0.094169 0.112869 0.146706 0.126030 0.152131 0.138609 0.154646 0.142431 0.142545 0.144102
qa: -0.1041 -0.3360 -0.1052 -0.3637 0.5298 -0.1946 0.2791 -0.2248 -0.3847 0.0046 -0.2055 -0.1414 -0.0357 -0.2466 -0.2679 -0.1553 -0.1372 -0.1273 0.0104 0.0854 0.0952 0.1115 0.1201 0.1062 0.1107 0.1122 0.1105 0.0942 0.1129 0.1467 0.1260 0.1521 0.1386 0.1546 0.1424 0.1425 0.1441
va: 1.2012 1.9052 2.6826 3.0812 3.4032 3.9416 3.8078 3.7364 3.9597 3.5448 3.9625 3.9404 4.0726 3.9683 4.0516 3.9213 4.0074 3.9558 3.9901 3.8311 1.0128 0.9947 0.9958 1.0001 0.9915 1.0123 0.9953 0.9992 0.9907 1.0037 1.0379 1.0164 1.0059 0.9946 1.0063 1.0051 0.9977
dispcorr: -0.019291692 hartree
energy: -1264.909817073909
dipole: 29.54363 -27.10965 2.43399 7.31303 -7.09912 0.21392 3.28581 -1.97119 1.31462
magnitude: 2.77458 au
magnitude: 7.05242 debye
