program: Orca
programVersion: 4.2.1
elementType: Cl O N N C C C C C C C C C C C C C C C C H H H H H H H H H H H H H H H H H
charge: 0
multiplicity: 1
keywords: wb97x-d3
keywords: def2-TZVPP
keywords: def2/J RIJCOSX GRIDX6 NOFINALGRIDX
keywords: grid4 nofinalgrid
keywords: scfconv7
keywords: smallprint printgap noloewdin
keywords: NOSOSCF
formula: C16H17ClN2O
InChI: InChI=1S/C16H17ClN2O/c1-16(13-4-3-9-18-11-13)10-15(20-19(16)2)12-5-7-14(17)8-6-12/h3-9,11,15H,10H2,1-2H3
37 atoms
Cl -4.866381 -1.784701 -0.999199
O  1.845331 -1.684674 -0.372934
N  1.956611 -0.299574 -0.685085
N  2.036031 4.131177 0.9044
C  2.204187 0.349866 0.617665
C  1.280876 -0.485106 1.541363
C  0.921117 -1.715548 0.684577
C  1.725884 1.783973 0.491721
C  3.650696 0.238199 1.098246
C  -0.518115 -1.71966 0.221113
C  2.983928 -0.165564 -1.686743
C  0.508682 2.065731 -0.126982
C  2.441924 2.867299 0.986336
C  -0.88083 -1.587851 -1.113575
C  -1.524361 -1.883352 1.170372
C  0.07719 3.375899 -0.219568
C  -2.21658 -1.60299 -1.493427
C  -2.86105 -1.90617 0.808252
C  0.877775 4.376868 0.31137
C  -3.196786 -1.761685 -0.529274
H  1.816261 -0.779734 2.443671
H  0.396793 0.065808 1.858222
H  1.111479 -2.641767 1.232802
H  4.349114 0.802402 0.47912
H  3.969675 -0.804889 1.099766
H  3.748408 0.60083 2.121661
H  3.133894 0.895523 -1.885046
H  2.646998 -0.625125 -2.616255
H  3.948256 -0.607001 -1.412272
H  -0.09412 1.264469 -0.535114
H  3.394991 2.721204 1.480323
H  -0.12813 -1.466122 -1.879726
H  -1.267698 -1.999882 2.217339
H  -0.862267 3.622469 -0.695619
H  -2.483157 -1.492608 -2.536168
H  -3.627366 -2.037882 1.560352
H  0.570121 5.41518 0.254901
elementType: Cl O N C H
totalener: -1264.89061985 hartree
nucrepener: 1654.77066439 hartree
electener: -2919.66128424 hartree
oneelecener: -5014.81287260 hartree
twoeener: 2095.15158836 hartree
cpcmener: -0.01971468 hartree
kineticenergy: 1260.64649139 hartree
xcener: -100.548833096452 hartree
chargesum: 0.0000000
charge: -0.104401 -0.335496 -0.086678 -0.367648 0.474118 -0.171696 0.284069 -0.206005 -0.380806 -0.026254 -0.203976 -0.137744 -0.019965 -0.226682 -0.263002 -0.186221 -0.130520 -0.135122 0.022415 0.083034 0.094162 0.113994 0.118782 0.110429 0.111078 0.110294 0.113163 0.110371 0.093383 0.152244 0.120740 0.143187 0.142099 0.153681 0.142188 0.142703 0.146079
qa: -0.1044 -0.3355 -0.0867 -0.3676 0.4741 -0.1717 0.2841 -0.2060 -0.3808 -0.0263 -0.2040 -0.1377 -0.0200 -0.2267 -0.2630 -0.1862 -0.1305 -0.1351 0.0224 0.0830 0.0942 0.1140 0.1188 0.1104 0.1111 0.1103 0.1132 0.1104 0.0934 0.1522 0.1207 0.1432 0.1421 0.1537 0.1422 0.1427 0.1461
va: 1.2010 1.9136 2.6630 3.0783 3.4884 3.9008 3.8382 3.6841 3.9521 3.5458 3.9626 3.9278 4.0931 3.9570 4.0267 3.9475 3.9956 3.9633 3.9778 3.8329 1.0110 1.0015 0.9940 0.9917 1.0115 0.9979 0.9910 0.9957 0.9983 1.0112 1.0116 1.0193 1.0030 0.9941 1.0057 1.0054 0.9979
dispcorr: -0.019604555 hartree
energy: -1264.910224401901
dipole: 25.95640 -25.33649 0.61991 5.48860 -6.00351 -0.51490 4.42589 -3.94090 0.48499
magnitude: 0.94055 au
magnitude: 2.39068 debye
