program: Orca
programVersion: 4.2.1
elementType: Cl O N N C C C C C C C C C C C C C C C C H H H H H H H H H H H H H H H H H
charge: 0
multiplicity: 1
keywords: wb97x-d3
keywords: def2-TZVPP
keywords: def2/J RIJCOSX GRIDX6 NOFINALGRIDX
keywords: grid4 nofinalgrid
keywords: scfconv7
keywords: smallprint printgap noloewdin
keywords: NOSOSCF
formula: C16H17ClN2O
InChI: InChI=1S/C16H17ClN2O/c1-16(13-4-3-9-18-11-13)10-15(20-19(16)2)12-5-7-14(17)8-6-12/h3-9,11,15H,10H2,1-2H3
37 atoms
Cl -4.905493 -1.90821 -0.966166
O  1.804167 -1.640275 -0.360508
N  1.92955 -0.261628 -0.678993
N  2.200749 4.175672 0.856879
C  2.178538 0.386861 0.622421
C  1.184212 -0.391469 1.516364
C  0.880229 -1.66652 0.700338
C  1.776774 1.841548 0.475483
C  3.603432 0.200825 1.140936
C  -0.556077 -1.73231 0.236976
C  2.962791 -0.139855 -1.675654
C  0.579955 2.17405 -0.158489
C  2.542208 2.893662 0.960586
C  -0.933315 -1.531492 -1.085224
C  -1.547246 -2.002284 1.176729
C  0.215692 3.501924 -0.273935
C  -2.269577 -1.582415 -1.459313
C  -2.884565 -2.060428 0.819776
C  1.061782 4.4694 0.249996
C  -3.235902 -1.844792 -0.503289
H  1.632132 -0.626605 2.481791
H  0.277736 0.179147 1.714548
H  1.104323 -2.565456 1.27993
H  3.8725 -0.856472 1.144335
H  3.693282 0.554309 2.168421
H  4.345067 0.731893 0.542925
H  2.621663 -0.585535 -2.610559
H  3.917428 -0.602129 -1.400502
H  3.13399 0.919714 -1.864574
H  -0.059885 1.398236 -0.559293
H  3.48295 2.706152 1.464274
H  -0.194201 -1.324431 -1.84631
H  -1.280126 -2.17436 2.21304
H  -0.706888 3.787455 -0.760903
H  -2.545845 -1.417443 -2.492007
H  -3.637765 -2.274007 1.566076
H  0.803338 5.519988 0.175848
elementType: Cl O N C H
totalener: -1264.89077065 hartree
nucrepener: 1649.20331674 hartree
electener: -2914.09408739 hartree
oneelecener: -5003.65833557 hartree
twoeener: 2089.56424818 hartree
cpcmener: -0.01972169 hartree
kineticenergy: 1260.66032316 hartree
xcener: -100.551413135871 hartree
chargesum: 0.0000000
charge: -0.103823 -0.335260 -0.097313 -0.367829 0.504507 -0.190232 0.286157 -0.218607 -0.382882 -0.002147 -0.203858 -0.134339 -0.016021 -0.243938 -0.274675 -0.189171 -0.128600 -0.125428 0.023517 0.079547 0.095340 0.112523 0.118281 0.112314 0.109028 0.109807 0.110073 0.093150 0.112791 0.154253 0.120321 0.147288 0.140172 0.153974 0.141945 0.143081 0.146056
qa: -0.1038 -0.3353 -0.0973 -0.3678 0.5045 -0.1902 0.2862 -0.2186 -0.3829 -0.0021 -0.2039 -0.1343 -0.0160 -0.2439 -0.2747 -0.1892 -0.1286 -0.1254 0.0235 0.0795 0.0953 0.1125 0.1183 0.1123 0.1090 0.1098 0.1101 0.0931 0.1128 0.1543 0.1203 0.1473 0.1402 0.1540 0.1419 0.1431 0.1461
va: 1.2017 1.9068 2.6796 3.0780 3.4505 3.9246 3.8176 3.6777 3.9559 3.5415 3.9619 3.9284 4.0888 3.9651 4.0418 3.9490 3.9945 3.9518 3.9784 3.8359 1.0119 0.9966 0.9960 1.0123 0.9993 0.9913 0.9952 0.9989 0.9910 1.0091 1.0116 1.0177 1.0047 0.9941 1.0058 1.0049 0.9978
dispcorr: -0.019459694 hartree
energy: -1264.910230341528
dipole: 25.81853 -25.25879 0.55974 5.99649 -6.43096 -0.43447 4.37810 -3.89037 0.48773
magnitude: 0.86021 au
magnitude: 2.18647 debye
