program: Orca
programVersion: 4.2.1
elementType: Cl O N N C C C C C C C C C C C C C C C C H H H H H H H H H H H H H H H H H
charge: 0
multiplicity: 1
keywords: wb97x-d3
keywords: def2-TZVPP
keywords: def2/J RIJCOSX GRIDX6 NOFINALGRIDX
keywords: grid4 nofinalgrid
keywords: scfconv7
keywords: smallprint printgap noloewdin
keywords: NOSOSCF
formula: C16H17ClN2O
InChI: InChI=1S/C16H17ClN2O/c1-16(13-4-3-9-18-11-13)10-15(20-19(16)2)12-5-7-14(17)8-6-12/h3-9,11,15H,10H2,1-2H3
37 atoms
Cl -4.903298 -1.897397 -0.970441
O  1.807159 -1.642918 -0.357614
N  1.933137 -0.265114 -0.677777
N  2.188968 4.174197 0.866466
C  2.179248 0.385846 0.622735
C  1.183611 -0.391308 1.51614
C  0.881298 -1.667691 0.701743
C  1.776035 1.839987 0.473262
C  3.603435 0.201684 1.143767
C  -0.554303 -1.733068 0.236288
C  2.967694 -0.144154 -1.673026
C  0.585554 2.171082 -0.173324
C  2.532813 2.892756 0.970226
C  -0.930046 -1.530719 -1.086196
C  -1.546798 -2.002042 1.174921
C  0.219377 3.498338 -0.289821
C  -2.266126 -1.578359 -1.461375
C  -2.883996 -2.056961 0.816863
C  1.056453 4.466622 0.246894
C  -3.23383 -1.839171 -0.506276
H  1.62931 -0.624361 2.483173
H  0.276562 0.179667 1.711032
H  1.104359 -2.565835 1.282936
H  3.691023 0.552226 2.172532
H  4.345109 0.735778 0.548498
H  3.87459 -0.855211 1.144922
H  3.138829 0.915286 -1.862908
H  2.628058 -0.590912 -2.607958
H  3.922144 -0.605724 -1.396002
H  -0.047977 1.394725 -0.58286
H  3.468099 2.706452 1.484497
H  -0.19005 -1.32461 -1.846731
H  -1.281103 -2.175525 2.21141
H  -0.698063 3.782468 -0.787228
H  -2.541137 -1.411635 -2.494156
H  -3.638219 -2.269589 1.562415
H  0.795988 5.516697 0.17231
elementType: Cl O N C H
totalener: -1264.89073567 hartree
nucrepener: 1649.42408566 hartree
electener: -2914.31482134 hartree
oneelecener: -5004.09885201 hartree
twoeener: 2089.78403067 hartree
cpcmener: -0.01971702 hartree
kineticenergy: 1260.65993598 hartree
xcener: -100.551382934819 hartree
chargesum: 0.0000000
charge: -0.103859 -0.335204 -0.097503 -0.367870 0.503109 -0.189303 0.285569 -0.217869 -0.382432 -0.001074 -0.203852 -0.133980 -0.017397 -0.244780 -0.274969 -0.188959 -0.128237 -0.125196 0.023575 0.079476 0.095093 0.112491 0.118307 0.108830 0.110245 0.112166 0.112802 0.110048 0.093194 0.154632 0.120321 0.147488 0.140106 0.153920 0.141962 0.143072 0.146077
qa: -0.1039 -0.3352 -0.0975 -0.3679 0.5031 -0.1893 0.2856 -0.2179 -0.3824 -0.0011 -0.2039 -0.1340 -0.0174 -0.2448 -0.2750 -0.1890 -0.1282 -0.1252 0.0236 0.0795 0.0951 0.1125 0.1183 0.1088 0.1102 0.1122 0.1128 0.1100 0.0932 0.1546 0.1203 0.1475 0.1401 0.1539 0.1420 0.1431 0.1461
va: 1.2017 1.9067 2.6783 3.0780 3.4516 3.9249 3.8183 3.6782 3.9554 3.5410 3.9618 3.9268 4.0903 3.9648 4.0419 3.9486 3.9937 3.9515 3.9781 3.8359 1.0120 0.9966 0.9960 0.9994 0.9913 1.0123 0.9910 0.9952 0.9989 1.0095 1.0116 1.0176 1.0047 0.9941 1.0058 1.0049 0.9978
dispcorr: -0.019469171 hartree
energy: -1264.910204843431
dipole: 25.82385 -25.25940 0.56445 5.96113 -6.39835 -0.43722 4.38163 -3.90362 0.47801
magnitude: 0.85923 au
magnitude: 2.18398 debye
