program: Orca
programVersion: 4.2.1
elementType: Cl O N N C C C C C C C C C C C C C C C C H H H H H H H H H H H H H H H H H
charge: 0
multiplicity: 1
keywords: wb97x-d3
keywords: def2-TZVPP
keywords: def2/J RIJCOSX GRIDX6 NOFINALGRIDX
keywords: grid4 nofinalgrid
keywords: scfconv7
keywords: smallprint printgap noloewdin
keywords: NOSOSCF
formula: C16H17ClN2O
InChI: InChI=1S/C16H17ClN2O/c1-16(13-4-3-9-18-11-13)10-15(20-19(16)2)12-5-7-14(17)8-6-12/h3-9,11,15H,10H2,1-2H3
37 atoms
Cl -4.691396 -0.39217 -0.050089
O  1.845203 -1.273541 -1.152928
N  2.889744 -0.391432 -0.785547
N  0.357889 2.793166 -1.174489
C  2.467216 0.135892 0.516461
C  1.874202 -1.111754 1.184496
C  1.172935 -1.780337 0.00373
C  1.398692 1.197504 0.287041
C  3.616994 0.751002 1.303714
C  -0.303459 -1.459627 -0.070755
C  4.136863 -1.133445 -0.797873
C  0.500477 1.545507 1.289164
C  1.285524 1.877055 -0.920865
C  -1.139569 -1.899673 0.95158
C  -0.857677 -0.718784 -1.107046
C  -0.473476 2.494662 1.03619
C  -2.487932 -1.581836 0.965886
C  -2.20493 -0.38836 -1.106692
C  -0.512125 3.082476 -0.2175
C  -3.008967 -0.816161 -0.065194
H  2.676405 -1.742148 1.572034
H  1.205861 -0.903217 2.016585
H  1.299808 -2.867983 0.041576
H  4.373643 0.015164 1.575669
H  3.234919 1.181211 2.229433
H  4.096628 1.554636 0.743105
H  4.270179 -1.565676 -1.788586
H  4.211534 -1.941522 -0.060419
H  4.96289 -0.442707 -0.638676
H  0.541766 1.075474 2.263901
H  1.972215 1.657523 -1.728902
H  -0.738514 -2.49491 1.764041
H  -0.242354 -0.374922 -1.92555
H  -1.194336 2.77013 1.793804
H  -3.119878 -1.925349 1.773831
H  -2.615298 0.202293 -1.914614
H  -1.269731 3.821642 -0.453687
elementType: Cl O N C H
totalener: -1264.88932625 hartree
nucrepener: 1725.76473323 hartree
electener: -2990.65405947 hartree
oneelecener: -5157.25161716 hartree
twoeener: 2166.59755769 hartree
cpcmener: -0.02294299 hartree
kineticenergy: 1260.66683958 hartree
xcener: -100.558669966886 hartree
chargesum: -0.0000000
charge: -0.107011 -0.355480 -0.065412 -0.348301 0.396266 -0.270577 0.269008 -0.063821 -0.282077 0.022184 -0.215605 -0.178558 -0.073587 -0.273494 -0.188668 -0.155613 -0.141357 -0.165117 -0.003479 0.102249 0.098477 0.108074 0.126683 0.102458 0.108373 0.114819 0.114784 0.092295 0.106569 0.139933 0.122725 0.139447 0.150258 0.149680 0.143102 0.137768 0.143008
qa: -0.1070 -0.3555 -0.0654 -0.3483 0.3963 -0.2706 0.2690 -0.0638 -0.2821 0.0222 -0.2156 -0.1786 -0.0736 -0.2735 -0.1887 -0.1556 -0.1414 -0.1651 -0.0035 0.1022 0.0985 0.1081 0.1267 0.1025 0.1084 0.1148 0.1148 0.0923 0.1066 0.1399 0.1227 0.1394 0.1503 0.1497 0.1431 0.1378 0.1430
va: 1.1985 1.9346 2.8373 3.0728 3.7985 3.9535 3.8547 3.6333 3.8663 3.5460 3.9792 3.9955 4.0838 4.0237 3.9579 3.9046 3.9732 3.9975 4.0028 3.8107 1.0165 1.0163 0.9858 0.9986 1.0033 1.0033 1.0017 0.9924 0.9962 1.0079 1.0553 1.0044 1.0185 0.9941 1.0046 1.0091 0.9998
dispcorr: -0.022182409 hartree
energy: -1264.911508654593
dipole: 28.63689 -27.09134 1.54555 -1.32183 0.27977 -1.04207 6.91925 -4.50959 2.40966
magnitude: 3.04649 au
magnitude: 7.74356 debye
