program: Orca
programVersion: 4.2.1
elementType: Cl O N N C C C C C C C C C C C C C C C C H H H H H H H H H H H H H H H H H
charge: 0
multiplicity: 1
keywords: wb97x-d3
keywords: def2-TZVPP
keywords: def2/J RIJCOSX GRIDX6 NOFINALGRIDX
keywords: grid4 nofinalgrid
keywords: scfconv7
keywords: smallprint printgap noloewdin
keywords: NOSOSCF
formula: C16H17ClN2O
InChI: InChI=1S/C16H17ClN2O/c1-16(13-4-3-9-18-11-13)10-15(20-19(16)2)12-5-7-14(17)8-6-12/h3-9,11,15H,10H2,1-2H3
37 atoms
Cl -4.769645 -0.715871 0.012031
O  1.797075 -1.262676 -1.110411
N  2.863203 -0.411308 -0.769102
N  0.474537 2.851033 -1.29072
C  2.453319 0.172231 0.508853
C  1.841186 -1.040872 1.225619
C  1.159184 -1.766482 0.062533
C  1.409682 1.247439 0.231521
C  3.616353 0.799173 1.268913
C  -0.329202 -1.514449 -0.005139
C  4.092445 -1.178124 -0.767802
C  0.497776 1.647585 1.198775
C  1.353509 1.904009 -0.995452
C  -0.917033 -0.770274 -1.019247
C  -1.143346 -2.030337 0.998054
C  -0.427575 2.632265 0.901705
C  -2.281487 -0.523245 -1.017682
C  -2.506933 -1.791899 1.013399
C  -0.402445 3.198936 -0.362309
C  -3.068893 -1.029985 0.00129
H  2.633871 -1.651398 1.663358
H  1.151597 -0.79094 2.028889
H  1.329443 -2.848218 0.129784
H  4.36067 0.062071 1.571155
H  3.244407 1.280835 2.172488
H  4.105324 1.566897 0.668613
H  4.933846 -0.499709 -0.636173
H  4.200843 -1.643946 -1.745076
H  4.157016 -1.965133 -0.004268
H  0.487629 1.190011 2.180377
H  2.05039 1.633569 -1.778982
H  -0.31216 -0.36646 -1.817646
H  -0.710363 -2.628662 1.792283
H  -1.159843 2.948225 1.631763
H  -2.725849 0.066658 -1.807314
H  -3.126668 -2.194689 1.802508
H  -1.116899 3.967748 -0.635764
totalener: -1264.86852509 hartree
nucrepener: 1714.00794250 hartree
electener: -2978.87646759 hartree
oneelecener: -5133.24122687 hartree
twoeener: 2154.36475928 hartree
kineticenergy: 1260.69126637 hartree
xcener: -100.560344700929 hartree
chargesum: -0.0000000
charge: -0.086703 -0.311015 -0.034828 -0.276443 0.379133 -0.285298 0.240618 -0.070075 -0.280524 0.029844 -0.221283 -0.180008 -0.067191 -0.182704 -0.259601 -0.121059 -0.130902 -0.118952 0.001248 0.089016 0.091723 0.099068 0.114097 0.091295 0.102485 0.115350 0.097797 0.119865 0.077226 0.111633 0.121956 0.150104 0.114273 0.119288 0.123249 0.120056 0.117263
qa: -0.0867 -0.3110 -0.0348 -0.2764 0.3791 -0.2853 0.2406 -0.0701 -0.2805 0.0298 -0.2213 -0.1800 -0.0672 -0.1827 -0.2596 -0.1211 -0.1309 -0.1190 0.0012 0.0890 0.0917 0.0991 0.1141 0.0913 0.1025 0.1153 0.0978 0.1199 0.0772 0.1116 0.1220 0.1501 0.1143 0.1193 0.1232 0.1201 0.1173
va: 1.2199 1.9817 2.8556 3.0989 3.8221 3.9255 3.8747 3.6522 3.8606 3.6066 3.9940 4.0270 4.0856 3.9988 4.0465 3.9135 3.9987 4.0097 4.0269 3.9110 1.0173 1.0208 0.9844 1.0000 1.0077 1.0050 0.9974 1.0046 0.9922 1.0153 1.0447 1.0150 1.0107 1.0031 1.0125 1.0125 1.0013
dispcorr: -0.021631895 hartree
energy: -1264.890156982219
dipole: 28.78515 -27.61539 1.16976 -0.10120 -0.51272 -0.61393 6.72419 -5.18579 1.53840
magnitude: 2.02779 au
magnitude: 5.15422 debye
