program: Gaussian 09
title: 000034413
version: EM64L-G09RevD.01
frameworkgroup: C1[X(C23H16N2O5)]
method: RPBEPBE
basis: SDD
operation: Freq
keyword: #p
keyword: freq=noraman
keyword: PBEPBE/SDD
title: #p freq=noraman PBEPBE/SDD
converged: YES YES NO NO
title: Mulliken charges:
elementType: O O O O O N N C C C C C C C C C C C C C C C C C C C C C C C H H H H H H H H H H H H H H H H
charge: -0.304483 -0.259335 -0.193407 -0.203587 -0.171393 0.009974 0.016857 -0.126890 0.494687 0.267325 0.237401 -0.428319 -0.375563 0.276581 -0.321214 0.363389 -0.461767 -0.481854 0.478302 0.178565 -0.345580 -0.166090 -0.347480 -0.370410 -0.213805 -0.394579 -0.380893 -0.226690 -0.226447 -0.229892 0.247944 0.282999 0.255274 0.212483 0.214539 0.288717 0.270991 0.237054 0.256167 0.252622 0.228744 0.233411 0.236307 0.228754 0.229471 0.231121
chargesum: 0.00000
title: Mulliken charges with hydrogens summed into heavy atoms:
elementType: O O O O O N N C C C C C C C C C C C C C C C C C C C C C C C
charge: -0.304483 -0.259335 -0.193407 -0.203587 -0.171393 0.009974 0.016857 -0.126890 0.494687 0.267325 0.237401 -0.180376 -0.092564 0.276581 -0.065941 0.363389 -0.034744 -0.193137 0.478302 0.178565 -0.074588 0.070964 -0.091313 -0.117788 0.014938 -0.161168 -0.144586 0.002063 0.003024 0.001229
polarizability: 4.02678727e+02 -9.58929966e+00 3.04678090e+02 -2.67352159e+00 8.06565005e+00 1.97203566e+02
1716.lowfreq: -13.2544 -7.4985 -2.2488 -0.0012 -0.0007 -0.0006 1.2511 8.9660 18.6450
frequency: -13.0860 8.9342 18.6250 27.9220 38.7356 48.9303 54.7768 61.4809 74.5268 84.8533 110.9420 132.7609 161.4258 170.7019 196.0606 209.8277 227.1187 229.9725 265.1216 286.5445 307.2310 325.5467 340.6760 398.7899 401.8855 402.8753 424.6235 429.6419 455.6528 472.9751 501.9038 518.1702 527.1047 528.2264 539.1479 557.9193 589.2507 604.6144 617.1899 623.4726 635.3810 666.5168 675.2853 701.0250 701.5462 709.4672 715.3636 746.0493 749.0470 763.7999 791.1026 799.0216 809.6402 822.4300 845.6034 852.3648 855.4654 870.7510 897.7995 906.2621 920.3203 926.5588 939.2987 947.4726 974.7728 975.4460 976.0130 982.0568 983.2878 991.0930 995.4907 997.9687 1026.2805 1027.3032 1033.2516 1061.0202 1090.1529 1099.0801 1139.0703 1149.2505 1152.8390 1173.4263 1187.3757 1188.4143 1197.5653 1198.5890 1209.4318 1223.6277 1229.8446 1239.6831 1255.0129 1291.7766 1326.9899 1330.0215 1356.0186 1358.7892 1378.1733 1388.0346 1397.4173 1403.0010 1424.5068 1438.8069 1441.6169 1445.8422 1469.0569 1478.8180 1487.5614 1490.7445 1556.9473 1583.0822 1593.6655 1598.0761 1613.0203 1617.1787 1618.3932 1672.7647 2960.0635 3020.9004 3122.5388 3125.5136 3133.3453 3137.1309 3140.3037 3141.7428 3144.6683 3150.1969 3166.0145 3166.7264 3171.9191 3172.3072 3185.7988 3194.1640
redmass: 3.7786 6.4683 6.3126 6.4118 5.5433 9.1288 7.0534 6.6922 7.2947 5.6931 7.4238 6.2457 5.8014 5.4473 6.0207 6.5299 6.6230 4.6797 5.8347 6.0453 9.1175 9.9940 2.3556 6.2400 2.8035 6.8252 4.2164 3.5974 5.7224 4.3671 4.2940 6.5889 5.3888 5.3970 5.6976 4.4626 6.8829 7.3412 6.3442 5.5849 5.7317 7.2446 2.9794 3.5284 2.5860 3.9919 3.5663 4.7070 4.1562 3.1461 1.3017 1.6011 5.1899 6.2890 3.7202 1.2478 1.6947 5.3437 1.4264 7.4974 2.3850 1.5075 2.9560 1.4141 1.3435 1.5362 1.3942 5.5330 1.4083 5.7370 1.3963 1.3483 2.6489 2.3620 2.5303 4.4240 1.5049 1.6669 1.8389 1.6887 1.7061 1.0537 1.1357 1.1899 1.1020 2.1428 4.0730 2.6175 2.4178 2.7375 3.5379 1.3541 1.2693 4.6695 1.4264 4.2144 2.9675 8.3902 6.4252 2.4906 4.5188 3.0882 2.1898 3.2926 2.3935 1.1528 2.4016 4.0177 9.2044 6.2812 6.0005 6.1421 7.5485 6.4413 6.4644 12.7674 1.0557 1.1076 1.0862 1.0877 1.0887 1.0920 1.0918 1.0877 1.0903 1.0963 1.1016 1.0942 1.0923 1.0993 1.0951 1.0956
irintensity: 0.0276 0.6178 3.3095 0.7179 1.2273 0.5916 2.4958 0.7560 0.1845 0.9527 0.4909 1.1917 0.2236 1.0996 4.1066 2.8907 4.7266 1.0828 0.1197 1.4660 0.0804 0.5413 0.9347 1.9884 0.0056 1.7532 0.8423 0.7931 3.4701 3.7128 3.5838 1.5549 4.6050 6.2370 10.6745 3.1206 5.4451 4.9244 0.1407 9.1274 1.6080 3.3394 2.8678 13.3862 34.2280 52.9009 29.3156 18.7293 32.8476 31.2307 5.6232 29.6373 73.1513 22.5023 92.3349 0.0605 63.8730 9.6018 2.2199 5.9003 389.8398 16.3710 254.2706 0.8010 1.1955 1.3364 0.0417 33.3002 1.5855 0.5338 1.1173 0.1390 25.4970 27.9705 0.2761 302.5575 6.9312 11.1978 39.3812 35.6044 21.7505 0.0041 3.1936 21.2780 10.1713 224.4419 201.9250 49.0967 4.3733 484.8498 297.6387 3.3715 0.3620 5.5550 42.9748 24.6525 157.8421 0.6269 7.6998 7.8971 26.6193 129.3367 8.9227 4.5437 43.4820 1.3763 7.7980 20.9416 32.3011 94.0952 10.4029 0.6733 15.5469 21.2671 11.4501 195.1853 39.6097 24.7093 5.4479 1.8698 8.2897 15.3574 8.8762 13.9577 10.1205 37.4982 23.9773 16.5923 5.1371 24.3657 3.3395 2.7576
temp: 298.150 k
press: 1.00000 atm
elementType: 8 8 8 8 8 7 7 6 6 6 6 6 6 6 6 6 6 6 6 6 6 6 6 6 6 6 6 6 6 6 1 1 1 1 1 1 1 1 1 1 1 1 1 1 1 1
symmnumber: 1
zpe: 884487.2 jmol-1
zpe.correction: 0.336883 hartree
zpe.thermalcorrener: 0.360826 hartree
zpe.thermalcorrenthalpy: 0.361771 hartree
zpe.thermalcorrgfe: 0.279127 hartree
zpe.sumelectzpe: -1369.506185 hartree
zpe.sumelectthermal: -1369.482242 hartree
zpe.sumelectthermalent: -1369.481298 hartree
zpe.sumelectthermalfe: -1369.563941 hartree
dipole: -0.0265 4.8386 2.5033
dipole: 5.4479
quadrupole: -115.4172 -167.1361 -166.9077
quadrupole: 28.0912 -4.7052 -2.5689
quadrupole: 34.4032 -17.3158 -17.0874 28.0912 -4.7052 -2.5689
hfenergy: -1369.8430681 hartree
pointgroup: C01 [X(C23H16N2O5)]
dipole: 0.1748346 -2.0344514 0.6514651 debye
polarizability: 400.1576917|18.0065967|260.8825703|-6.2253575|-54.6924504|243.5201213 unknown
InChI: InChI=1S/C23H16N2O5/c26-23(18-8-4-10-19(14-18)29-15-16-6-2-1-3-7-16)30-22-20(25(27)28)12-11-17-9-5-13-24-21(17)22/h1-14H,15H2
charge 0 multiplicity 1
46 atoms
O  2.219876 0.307783 -0.965748
O  -3.761486 -0.295564 -0.173891
O  1.088585 0.764676 1.037379
O  4.636904 3.351863 -2.287371
O  2.492921 2.946757 -1.621141
N  3.208788 -1.585622 0.797905
N  3.755513 2.697749 -1.600178
C  4.006606 -0.492844 0.502091
C  5.343122 -0.32588 1.028321
C  3.467085 0.514969 -0.376359
C  4.262532 1.61952 -0.718658
C  6.122815 0.811598 0.640233
C  5.598139 1.760042 -0.229565
C  -0.160754 -0.024124 -0.916494
C  5.827493 -1.337926 1.919677
C  -2.583715 -0.360206 -0.932969
C  -5.034372 -0.648827 -0.8588
C  -1.404241 0.007528 -0.245684
C  -6.15524 -0.493116 0.140513
C  1.038874 0.379769 -0.142292
C  -0.083831 -0.421571 -2.278988
C  5.011347 -2.426117 2.230575
C  -2.517971 -0.757648 -2.294118
C  3.709021 -2.510021 1.63709
C  -1.26529 -0.783325 -2.951584
C  -6.591187 -1.6010 0.908704
C  -6.77818 0.765743 0.329814
C  -7.631945 -1.454771 1.852743
C  -7.818361 0.916171 1.273141
C  -8.24811 -0.195051 2.03585
H  7.137913 0.927892 1.035011
H  6.17487 2.629145 -0.555626
H  6.833101 -1.244746 2.344586
H  -4.96701 -1.693104 -1.225305
H  -5.170271 0.028835 -1.72596
H  -1.458992 0.31713 0.802143
H  0.883337 -0.436493 -2.785017
H  5.347638 -3.215565 2.909308
H  -3.419139 -1.042876 -2.844483
H  3.057871 -3.363536 1.8581
H  -1.221262 -1.088443 -4.002533
H  -6.10958 -2.576777 0.771452
H  -6.441134 1.628826 -0.25674
H  -7.961361 -2.317554 2.442058
H  -8.29253 1.893774 1.413213
H  -9.056688 -0.079964 2.766396
