program: Orca
programVersion: 4.2.1
elementType: Cl O N N C C C C C C C C C C C C C C C C H H H H H H H H H H H H H H H H H
charge: 0
multiplicity: 1
keywords: wb97x-d3
keywords: def2-TZVPP
keywords: def2/J RIJCOSX GRIDX6 NOFINALGRIDX
keywords: grid4 nofinalgrid
keywords: scfconv7
keywords: smallprint printgap noloewdin
keywords: NOSOSCF
formula: C16H17ClN2O
InChI: InChI=1S/C16H17ClN2O/c1-16(13-4-3-9-18-11-13)10-15(20-19(16)2)12-5-7-14(17)8-6-12/h3-9,11,15H,10H2,1-2H3
37 atoms
Cl -4.689755 -1.705838 -1.309377
O  1.958266 -1.73818 -0.353793
N  2.002314 -0.353567 -0.663825
N  1.865668 4.06395 0.998745
C  2.232404 0.304676 0.634616
C  1.352703 -0.577177 1.559946
C  1.002547 -1.788116 0.671926
C  1.688481 1.715509 0.524011
C  3.688462 0.250541 1.09969
C  -0.419691 -1.759723 0.153179
C  2.990367 -0.152662 -1.689384
C  0.468478 1.9438 -0.110837
C  2.335127 2.82355 1.05715
C  -0.706739 -1.851541 -1.202755
C  -1.48115 -1.673666 1.048333
C  -0.029521 3.230729 -0.178476
C  -2.016442 -1.833876 -1.656975
C  -2.795355 -1.66134 0.611314
C  0.708337 4.259295 0.391707
C  -3.055614 -1.735592 -0.747166
H  1.916347 -0.882062 2.442124
H  0.467929 -0.047411 1.907576
H  1.169011 -2.730997 1.200525
H  4.055138 -0.775704 1.062193
H  3.782716 0.58835 2.131942
H  4.347604 0.867574 0.488378
H  3.983004 -0.548714 -1.448585
H  3.07437 0.919086 -1.867219
H  2.649111 -0.615992 -2.614468
H  -0.076542 1.116791 -0.547625
H  3.287108 2.717556 1.564553
H  0.096976 -1.932959 -1.92043
H  -1.289879 -1.611947 2.113573
H  -0.973114 3.437046 -0.665012
H  -2.226293 -1.896624 -2.715813
H  -3.608768 -1.591134 1.320096
H  0.348578 5.281892 0.356779
totalener: -1264.87096877 hartree
nucrepener: 1664.01063260 hartree
electener: -2928.88160137 hartree
oneelecener: -5032.99202706 hartree
twoeener: 2104.11042570 hartree
kineticenergy: 1260.68859798 hartree
xcener: -100.555989610683 hartree
chargesum: -0.0000000
charge: -0.083749 -0.289088 -0.071593 -0.292519 0.463848 -0.186330 0.263099 -0.211395 -0.388575 -0.072444 -0.202757 -0.115982 -0.040359 -0.161684 -0.207964 -0.144767 -0.116078 -0.126339 0.020593 0.081395 0.087373 0.111001 0.102745 0.113857 0.099556 0.106780 0.090844 0.108862 0.103387 0.143029 0.097644 0.116509 0.115764 0.125176 0.120911 0.120159 0.119090
qa: -0.0837 -0.2891 -0.0716 -0.2925 0.4638 -0.1863 0.2631 -0.2114 -0.3886 -0.0724 -0.2028 -0.1160 -0.0404 -0.1617 -0.2080 -0.1448 -0.1161 -0.1263 0.0206 0.0814 0.0874 0.1110 0.1027 0.1139 0.0996 0.1068 0.0908 0.1089 0.1034 0.1430 0.0976 0.1165 0.1158 0.1252 0.1209 0.1202 0.1191
va: 1.2228 1.9613 2.6934 3.1196 3.4994 3.8880 3.8827 3.6734 3.9472 3.6695 3.9728 3.9531 4.1295 3.9859 4.0081 3.9242 3.9962 4.0179 4.0009 3.9254 1.0130 1.0093 0.9911 1.0128 1.0009 0.9936 0.9986 0.9920 0.9997 1.0154 1.0100 1.0278 1.0079 1.0025 1.0120 1.0135 1.0005
dispcorr: -0.019834278 hartree
energy: -1264.890803047518
dipole: 25.44017 -24.96477 0.47540 5.25058 -5.68856 -0.43797 5.32846 -5.09251 0.23596
magnitude: 0.68812 au
magnitude: 1.74905 debye
