program: Gaussian 09
title: 000034396
version: EM64L-G09RevD.01
frameworkgroup: C1[X(C18H11ClN2O4)]
method: RPBEPBE
basis: SDD
operation: Freq
keyword: #p
keyword: freq=noraman
keyword: PBEPBE/SDD
title: #p freq=noraman PBEPBE/SDD
converged: YES YES NO NO
title: Mulliken charges:
elementType: Cl O O O O N N C C C C C C C C C C C C C C C C C C H H H H H H H H H H H
charge: -0.040303 -0.291855 -0.202452 -0.173726 -0.197858 0.007754 0.017641 0.495928 -0.127727 0.251729 0.239101 -0.427953 -0.373165 -0.320405 -0.166257 -0.370103 0.503811 0.224652 -0.238367 -0.332316 -0.352271 -0.373301 -0.217196 -0.220931 -0.107854 0.248313 0.283178 0.255665 0.237385 0.251742 0.259798 0.253995 0.239197 0.244003 0.259592 0.260555
chargesum: 0.00000
title: Mulliken charges with hydrogens summed into heavy atoms:
elementType: Cl O O O O N N C C C C C C C C C C C C C C C C C C
charge: -0.040303 -0.291855 -0.202452 -0.173726 -0.197858 0.007754 0.017641 0.495928 -0.127727 0.251729 0.239101 -0.179639 -0.089987 -0.064740 0.071128 -0.118360 0.503811 0.224652 0.021431 -0.078321 -0.113074 -0.129298 0.042396 0.039623 -0.107854
polarizability: 4.44278385e+02 1.77168250e+00 2.42997764e+02 4.08549201e+00 -1.10775557e+01 1.42268206e+02
1716.lowfreq: -3.5044 -0.0019 -0.0015 -0.0008 0.5727 6.1565 13.9554 26.5784 31.7183
frequency: 13.8804 26.4289 31.7132 43.3154 57.2659 65.8593 77.3028 83.7203 132.2410 141.1387 163.4189 180.3726 204.0661 212.2206 225.4871 272.2325 294.3217 311.8914 325.4340 344.1299 381.8011 408.4948 409.9800 425.3777 466.5432 472.3528 494.6740 518.1824 538.3877 547.7452 585.3047 601.3273 626.4000 631.9543 646.3174 648.8680 688.5573 706.9368 721.6501 729.1909 748.6607 790.7733 804.2149 818.9988 826.4257 831.2052 855.1606 866.0631 893.6014 906.6953 916.6045 946.8933 956.7720 969.2873 974.5573 995.4810 998.3516 1008.7661 1033.8133 1058.4577 1062.4118 1080.0768 1111.7044 1141.7858 1152.5433 1189.0989 1200.2247 1210.6189 1220.7563 1224.1376 1245.1322 1293.8935 1302.1266 1317.2584 1330.5244 1358.5915 1376.7092 1380.0896 1403.1264 1406.0496 1424.6092 1442.5844 1480.2512 1491.2805 1556.5822 1572.2796 1593.4540 1597.3848 1612.6145 1641.8462 1667.0159 3104.3248 3132.4088 3138.2688 3139.9692 3144.4072 3149.3040 3170.0894 3172.2414 3172.9248 3176.5784 3185.6050
redmass: 9.3556 4.0578 7.7422 7.9265 12.8941 7.2872 10.8529 8.4573 6.4677 4.1702 6.7479 3.8879 7.9106 8.4548 6.8276 6.4849 6.0413 7.7197 9.0408 4.1480 8.8204 5.3355 3.3309 4.4077 5.7522 4.3263 2.7484 6.7017 5.7081 4.6801 6.6138 6.8469 7.0977 5.6822 6.6814 6.0390 6.8180 7.3797 3.6274 5.1595 9.9555 1.2897 5.4618 5.9490 1.2670 1.5339 1.7161 5.2650 1.9077 7.4410 6.0065 1.4175 1.3425 1.3770 1.3411 1.3957 3.9910 1.1977 2.5236 4.5645 3.6148 2.8610 1.4022 1.7470 1.5249 1.1376 2.0151 4.5568 1.6744 2.5758 2.3700 1.3883 2.1356 1.4054 4.6295 4.3645 3.5892 3.3999 2.5377 3.3669 4.3971 3.0906 2.4502 4.0027 9.1340 7.0884 5.9905 6.0879 7.5437 6.6108 9.4331 1.0903 1.0889 1.0900 1.0916 1.0903 1.0890 1.0921 1.0993 1.0955 1.0969 1.0952
irintensity: 1.4369 0.2424 0.6906 1.0417 1.6334 2.7238 0.8574 1.0865 1.1829 1.0100 2.2793 0.1097 1.9381 1.9223 5.1237 0.0906 0.0827 0.1833 1.6709 0.0671 31.1209 11.1167 3.2545 0.9756 4.7267 1.7185 27.7736 0.7268 4.3195 4.8885 2.9769 4.3904 0.6154 1.2116 2.9822 3.8496 1.0813 3.2718 1.1972 28.9604 28.2597 6.8675 137.4018 41.3947 2.3213 74.5027 70.4954 6.6206 3.1798 2.6402 208.3939 1.1143 3.0234 0.0390 0.8831 1.0228 58.4712 38.5850 0.3458 773.1127 327.2046 94.7425 9.5281 4.3880 9.7342 24.1125 57.6420 209.9912 36.6772 44.7699 100.5844 0.9898 126.4724 1.0205 6.0848 26.9348 229.6375 7.6985 9.3527 18.5075 24.0810 72.3701 100.4046 19.4099 47.0716 5.0233 11.7918 146.0596 27.4895 397.7352 143.9506 2.0495 9.6246 5.9047 7.8722 10.3955 4.4830 5.2552 25.5232 5.9012 2.8563 3.4020
temp: 298.150 k
press: 1.00000 atm
elementType: 17 8 8 8 8 7 7 6 6 6 6 6 6 6 6 6 6 6 6 6 6 6 6 6 6 1 1 1 1 1 1 1 1 1 1 1
symmnumber: 1
zpe: 654537.7 jmol-1
zpe.correction: 0.249300 hartree
zpe.thermalcorrener: 0.270326 hartree
zpe.thermalcorrenthalpy: 0.271270 hartree
zpe.thermalcorrgfe: 0.195678 hartree
zpe.sumelectzpe: -1561.156686 hartree
zpe.sumelectthermal: -1561.135660 hartree
zpe.sumelectthermalent: -1561.134716 hartree
zpe.sumelectthermalfe: -1561.210309 hartree
dipole: 2.7200 -5.4211 -0.7678
dipole: 6.1136
quadrupole: -119.1589 -154.7335 -148.0784
quadrupole: -18.5158 -3.6838 -1.5068
quadrupole: 21.4980 -14.0766 -7.4215 -18.5158 -3.6838 -1.5068
hfenergy: -1561.4059864 hartree
pointgroup: C01 [X(C18H11Cl1N2O4)]
dipole: 1.2112152 2.0620079 0.2577734 debye
polarizability: 442.7444062|-14.8638324|243.9220717|-13.0744415|-10.9110252|142.877877 unknown
InChI: InChI=1S/C18H11ClN2O4/c19-14-7-3-12(4-8-14)5-10-16(22)25-18-15(21(23)24)9-6-13-2-1-11-20-17(13)18/h1-11H
charge 0 multiplicity 1
36 atoms
Cl -8.34612 0.565336 0.821299
O  0.893321 -0.626039 0.419031
O  3.099062 -4.084644 0.369077
O  1.183753 -3.189807 -0.489688
O  0.343104 0.212865 -1.714047
N  2.163313 1.834535 0.344877
N  2.3834 -3.084092 -0.034828
C  4.371779 0.738461 0.00064
C  2.935481 0.698576 0.167133
C  2.26292 -0.576332 0.155609
C  3.021868 -1.747329 0.00704
C  5.105796 -0.484358 -0.134787
C  4.445056 -1.706976 -0.117363
C  4.994737 2.02893 -0.00698
C  4.20918 3.171016 0.152868
C  2.794987 3.02216 0.333272
C  -3.854065 0.322041 -0.335051
C  -0.028737 -0.124707 -0.57531
C  -2.449651 0.269674 -0.752019
C  -1.379018 -0.137258 -0.001819
C  -4.298494 -0.069245 0.962631
C  -4.82618 0.786466 -1.267571
C  -5.657803 0.00229 1.316781
C  -6.192078 0.86453 -0.929167
C  -6.588438 0.47038 0.363724
H  6.194251 -0.448049 -0.251978
H  4.980298 -2.655956 -0.202701
H  6.080274 2.102275 -0.136299
H  4.651332 4.171764 0.150244
H  2.162639 3.906378 0.473541
H  -2.231826 0.594246 -1.780167
H  -1.462349 -0.48393 1.03173
H  -3.579921 -0.434396 1.703384
H  -4.505926 1.090332 -2.270943
H  -5.994189 -0.299534 2.31262
H  -6.930657 1.222596 -1.651681
