program: Orca
programVersion: 4.2.1
elementType: Cl O N N C C C C C C C C C C C C C C C C H H H H H H H H H H H H H H H H H
charge: 0
multiplicity: 1
keywords: wb97x-d3
keywords: def2-TZVPP
keywords: def2/J RIJCOSX GRIDX6 NOFINALGRIDX
keywords: grid4 nofinalgrid
keywords: scfconv7
keywords: smallprint printgap noloewdin
keywords: NOSOSCF
formula: C16H17ClN2O
InChI: InChI=1S/C16H17ClN2O/c1-16(13-4-3-9-18-11-13)10-15(20-19(16)2)12-5-7-14(17)8-6-12/h3-9,11,15H,10H2,1-2H3
37 atoms
Cl -4.846634 -1.901938 -1.091234
O  1.830017 -1.674068 -0.286273
N  1.925077 -0.299794 -0.626538
N  2.155956 4.161352 0.857933
C  2.176098 0.37165 0.660718
C  1.199443 -0.41235 1.571625
C  0.885525 -1.684062 0.751148
C  1.758687 1.819508 0.498886
C  3.608962 0.205012 1.169842
C  -0.543006 -1.72673 0.256002
C  2.933786 -0.162671 -1.643858
C  0.561102 2.129617 -0.144262
C  2.508929 2.886908 0.976173
C  -1.579949 -1.78373 1.182016
C  -0.861801 -1.737174 -1.095331
C  0.183727 3.452076 -0.27355
C  -2.903769 -1.840043 0.780672
C  -2.183506 -1.786516 -1.513473
C  1.018169 4.43394 0.244372
C  -3.19854 -1.836988 -0.573479
H  1.668637 -0.648536 2.527178
H  0.297816 0.158996 1.78664
H  1.081954 -2.589265 1.332763
H  3.887839 -0.849056 1.170345
H  3.70381 0.565165 2.194417
H  4.336159 0.744219 0.562019
H  3.904899 -0.596231 -1.380538
H  3.06617 0.900423 -1.842747
H  2.585324 -0.631417 -2.563499
H  -0.05983 1.336583 -0.541707
H  3.45072 2.717582 1.485325
H  -1.358325 -1.786195 2.243569
H  -0.077224 -1.705671 -1.837644
H  -0.739353 3.72231 -0.768076
H  -3.698219 -1.886733 1.512556
H  -2.420718 -1.788964 -2.568599
H  0.753576 5.482447 0.160482
totalener: -1264.87144044 hartree
nucrepener: 1652.57044182 hartree
electener: -2917.44188226 hartree
oneelecener: -5010.08659494 hartree
twoeener: 2092.64471269 hartree
kineticenergy: 1260.68181976 hartree
xcener: -100.554055252680 hartree
chargesum: 0.0000000
charge: -0.084330 -0.289057 -0.081922 -0.292405 0.484236 -0.203180 0.263572 -0.214072 -0.392663 -0.028540 -0.200756 -0.118925 -0.033380 -0.243416 -0.185140 -0.148363 -0.116500 -0.104361 0.020997 0.075946 0.087827 0.113253 0.105214 0.115859 0.098793 0.105046 0.090028 0.108569 0.103574 0.142128 0.098080 0.118595 0.119577 0.125410 0.120012 0.120888 0.119409
qa: -0.0843 -0.2891 -0.0819 -0.2924 0.4842 -0.2032 0.2636 -0.2141 -0.3927 -0.0285 -0.2008 -0.1189 -0.0334 -0.2434 -0.1851 -0.1484 -0.1165 -0.1044 0.0210 0.0759 0.0878 0.1133 0.1052 0.1159 0.0988 0.1050 0.0900 0.1086 0.1036 0.1421 0.0981 0.1186 0.1196 0.1254 0.1200 0.1209 0.1194
va: 1.2223 1.9564 2.7107 3.1191 3.4782 3.9091 3.8569 3.6620 3.9529 3.6281 3.9710 3.9606 4.1209 4.0339 3.9887 3.9287 4.0050 3.9880 4.0026 3.9300 1.0124 1.0023 0.9933 1.0135 1.0020 0.9935 0.9994 0.9921 0.9993 1.0147 1.0096 1.0080 1.0265 1.0024 1.0130 1.0117 1.0005
dispcorr: -0.019494193 hartree
energy: -1264.890934629466
dipole: 25.57709 -25.13765 0.43944 5.95582 -6.29953 -0.34371 4.83731 -4.57822 0.25909
magnitude: 0.61512 au
magnitude: 1.56350 debye
