program: Orca
programVersion: 4.2.1
elementType: Cl O N N C C C C C C C C C C C C C C C C H H H H H H H H H H H H H H H H H
charge: 0
multiplicity: 1
keywords: wb97x-d3
keywords: def2-TZVPP
keywords: def2/J RIJCOSX GRIDX6 NOFINALGRIDX
keywords: grid4 nofinalgrid
keywords: scfconv7
keywords: smallprint printgap noloewdin
keywords: NOSOSCF
formula: C16H17ClN2O
InChI: InChI=1S/C16H17ClN2O/c1-16(13-4-3-9-18-11-13)10-15(20-19(16)2)12-5-7-14(17)8-6-12/h3-9,11,15H,10H2,1-2H3
37 atoms
Cl -4.896059 -1.24449 0.097479
O  1.68702 -1.196207 -1.070896
N  2.821153 -0.429732 -0.768794
N  -0.12611 3.006826 0.838638
C  2.44719 0.259046 0.467076
C  1.729265 -0.851907 1.255208
C  1.102441 -1.693473 0.132854
C  1.507125 1.40256 0.108002
C  3.651352 0.833795 1.206017
C  -0.398237 -1.584805 0.059576
C  3.982659 -1.294471 -0.701179
C  1.46429 1.945286 -1.169574
C  0.691469 1.992452 1.069158
C  -1.045789 -0.683594 -0.776231
C  -1.167622 -2.38878 0.89397
C  0.607139 3.002656 -1.42646
C  -2.428069 -0.577468 -0.766881
C  -2.548404 -2.290241 0.917765
C  -0.17155 3.495378 -0.39123
C  -3.172584 -1.377838 0.082539
H  2.457068 -1.435459 1.823329
H  0.988725 -0.488276 1.964375
H  1.366798 -2.750865 0.263999
H  3.313717 1.388326 2.080661
H  4.202567 1.528681 0.571844
H  4.334077 0.058045 1.553542
H  4.877154 -0.680984 -0.607353
H  4.055949 -1.836007 -1.64203
H  3.978837 -2.026284 0.117867
H  2.085677 1.530276 -1.951255
H  0.693884 1.625475 2.091641
H  -0.478247 -0.053471 -1.444912
H  -0.683733 -3.110036 1.542889
H  0.543522 3.439111 -2.414204
H  -2.921732 0.130291 -1.418258
H  -3.133582 -2.920343 1.573039
H  -0.856912 4.31907 -0.557987
totalener: -1264.87042699 hartree
nucrepener: 1689.00005438 hartree
electener: -2953.87048137 hartree
oneelecener: -5083.17885315 hartree
twoeener: 2129.30837178 hartree
kineticenergy: 1260.68756955 hartree
xcener: -100.558096363031 hartree
chargesum: -0.0000000
charge: -0.085209 -0.301071 -0.016872 -0.278062 0.357173 -0.262787 0.219654 -0.099297 -0.281966 0.006150 -0.219662 -0.183539 -0.067062 -0.192698 -0.217985 -0.111779 -0.115310 -0.121401 0.007253 0.086149 0.090381 0.111768 0.106993 0.105508 0.113063 0.089087 0.098259 0.119341 0.078352 0.138036 0.090871 0.148749 0.108400 0.124730 0.117316 0.118943 0.118525
qa: -0.0852 -0.3011 -0.0169 -0.2781 0.3572 -0.2628 0.2197 -0.0993 -0.2820 0.0062 -0.2197 -0.1835 -0.0671 -0.1927 -0.2180 -0.1118 -0.1153 -0.1214 0.0073 0.0861 0.0904 0.1118 0.1070 0.1055 0.1131 0.0891 0.0983 0.1193 0.0784 0.1380 0.0909 0.1487 0.1084 0.1247 0.1173 0.1189 0.1185
va: 1.2212 1.9750 2.8570 3.1263 3.8650 3.8916 3.8575 3.6026 3.8713 3.6799 3.9966 3.9782 4.1419 4.0190 4.0604 3.8832 4.0154 4.0122 4.0157 3.9263 1.0153 1.0129 0.9900 1.0070 1.0046 1.0003 0.9971 1.0050 0.9900 1.0401 1.0180 1.0084 1.0151 1.0026 1.0149 1.0128 1.0009
dispcorr: -0.020620916 hartree
energy: -1264.891047909175
dipole: 30.34329 -28.71386 1.62943 1.79072 -2.29369 -0.50296 3.05926 -2.82043 0.23883
magnitude: 1.72193 au
magnitude: 4.37680 debye
