program: Orca
programVersion: 4.2.1
elementType: Cl O N N C C C C C C C C C C C C C C C C H H H H H H H H H H H H H H H H H
charge: 0
multiplicity: 1
keywords: wb97x-d3
keywords: def2-TZVPP
keywords: def2/J RIJCOSX GRIDX6 NOFINALGRIDX
keywords: grid4 nofinalgrid
keywords: scfconv7
keywords: smallprint printgap noloewdin
keywords: NOSOSCF
formula: C16H17ClN2O
InChI: InChI=1S/C16H17ClN2O/c1-16(13-4-3-9-18-11-13)10-15(20-19(16)2)12-5-7-14(17)8-6-12/h3-9,11,15H,10H2,1-2H3
37 atoms
Cl -5.829065 -0.890009 -1.004853
O  0.043031 1.586736 0.963307
N  1.444502 1.531958 0.701145
N  4.938706 -1.158592 -1.147424
C  1.605793 0.310448 -0.107951
C  0.733483 -0.649483 0.713586
C  -0.373414 0.269219 1.266034
C  3.062981 -0.103991 -0.069912
C  1.069345 0.438246 -1.535371
C  -1.740325 0.020224 0.680808
C  1.789052 2.771879 0.045986
C  3.845489 0.102863 1.064484
C  3.674745 -0.744773 -1.141648
C  -2.428386 0.972368 -0.06168
C  -2.346368 -1.214403 0.904281
C  5.164946 -0.312822 1.06796
C  -3.68749 0.698568 -0.580475
C  -3.598372 -1.504919 0.38961
C  5.667309 -0.938162 -0.061528
C  -4.261335 -0.539447 -0.353372
H  0.34962 -1.470079 0.109308
H  1.304684 -1.08096 1.534789
H  -0.436755 0.140435 2.353472
H  0.998445 -0.538351 -2.012381
H  1.702227 1.067924 -2.161437
H  0.066308 0.863912 -1.540424
H  2.835481 2.720892 -0.252023
H  1.693085 3.598378 0.749315
H  1.185888 2.998657 -0.838466
H  3.429922 0.590303 1.934933
H  3.12263 -0.946114 -2.050793
H  -1.993301 1.943204 -0.252469
H  -1.835241 -1.971597 1.486869
H  5.796086 -0.156124 1.931662
H  -4.20813 1.450918 -1.157148
H  -4.048501 -2.47177 0.568081
H  6.696242 -1.276576 -0.088801
elementType: Cl O N C H
totalener: -1264.88294054 hartree
nucrepener: 1618.12118345 hartree
electener: -2883.00412399 hartree
oneelecener: -4941.41685724 hartree
twoeener: 2058.41273325 hartree
cpcmener: -0.02287210 hartree
kineticenergy: 1260.65819968 hartree
xcener: -100.552454095564 hartree
chargesum: 0.0000000
charge: -0.105130 -0.350197 -0.084024 -0.376443 0.461791 -0.163704 0.243826 -0.196703 -0.379325 0.023380 -0.209505 -0.133802 -0.030606 -0.238132 -0.260851 -0.184811 -0.142354 -0.133238 0.023508 0.080851 0.100135 0.104636 0.112377 0.111105 0.121615 0.112483 0.112882 0.119084 0.094705 0.149359 0.122340 0.150075 0.148217 0.156841 0.145407 0.146250 0.147959
qa: -0.1051 -0.3502 -0.0840 -0.3764 0.4618 -0.1637 0.2438 -0.1967 -0.3793 0.0234 -0.2095 -0.1338 -0.0306 -0.2381 -0.2609 -0.1848 -0.1424 -0.1332 0.0235 0.0809 0.1001 0.1046 0.1124 0.1111 0.1216 0.1125 0.1129 0.1191 0.0947 0.1494 0.1223 0.1501 0.1482 0.1568 0.1454 0.1462 0.1480
va: 1.2003 1.8928 2.7173 3.0725 3.6303 3.8825 3.8366 3.6503 3.9422 3.5732 3.9564 3.9285 4.0988 3.9704 4.0246 3.9372 3.9988 3.9551 3.9772 3.8240 1.0170 1.0063 0.9958 1.0022 0.9913 1.0087 0.9933 0.9955 0.9986 1.0336 1.0153 1.0216 1.0011 0.9938 1.0050 1.0040 0.9980
dispcorr: -0.018872027 hartree
energy: -1264.901812567428
dipole: 23.56685 -22.96098 0.60588 6.37204 -6.26465 0.10739 1.62885 -0.83892 0.78992
magnitude: 1.00130 au
magnitude: 2.54510 debye
