program: Orca
programVersion: 4.2.1
elementType: Cl O N N C C C C C C C C C C C C C C C C H H H H H H H H H H H H H H H H H
charge: 0
multiplicity: 1
keywords: wb97x-d3
keywords: def2-TZVPP
keywords: def2/J RIJCOSX GRIDX6 NOFINALGRIDX
keywords: grid4 nofinalgrid
keywords: scfconv7
keywords: smallprint printgap noloewdin
keywords: NOSOSCF
formula: C16H17ClN2O
InChI: InChI=1S/C16H17ClN2O/c1-16(13-4-3-9-18-11-13)10-15(20-19(16)2)12-5-7-14(17)8-6-12/h3-9,11,15H,10H2,1-2H3
37 atoms
Cl -5.826555 -1.297257 -0.681619
O  0.014371 1.872029 0.020092
N  1.40564 1.756114 -0.169318
N  4.746302 -1.486409 0.911644
C  1.602625 0.292029 -0.205717
C  0.682148 -0.203185 0.920728
C  -0.434945 0.851929 0.916989
C  3.059547 -0.073953 -0.055949
C  1.122618 -0.247801 -1.55645
C  -1.782558 0.342634 0.475981
C  2.071641 2.427771 0.93992
C  4.032246 0.532603 -0.848556
C  3.483634 -1.083456 0.797791
C  -2.419392 -0.612368 1.266095
C  -2.424563 0.789418 -0.672723
C  5.350273 0.131845 -0.732079
C  -3.657502 -1.124711 0.918417
C  -3.668755 0.287517 -1.033723
C  5.658021 -0.880994 0.163227
C  -4.274287 -0.667145 -0.236461
H  0.312469 -1.211517 0.738277
H  1.184089 -0.209799 1.887849
H  -0.544313 1.273058 1.923085
H  1.24731 -1.330324 -1.586967
H  1.699285 0.179129 -2.377337
H  0.070016 -0.034598 -1.739635
H  1.706665 3.451855 0.991658
H  3.140065 2.480666 0.744274
H  1.93057 1.961428 1.921245
H  3.767238 1.315338 -1.548139
H  2.772019 -1.61133 1.42116
H  -1.944901 -0.96875 2.172607
H  -1.966569 1.534149 -1.308157
H  6.128017 0.591138 -1.325984
H  -4.133595 -1.867873 1.543182
H  -4.154497 0.645009 -1.931343
H  6.681254 -1.219314 0.274507
elementType: Cl O N C H
totalener: -1264.88423215 hartree
nucrepener: 1620.72348020 hartree
electener: -2885.60771235 hartree
oneelecener: -4946.57833638 hartree
twoeener: 2060.97062402 hartree
cpcmener: -0.02534760 hartree
kineticenergy: 1260.65320689 hartree
xcener: -100.552380493938 hartree
chargesum: -0.0000000
charge: -0.104865 -0.360604 -0.043648 -0.372968 0.386315 -0.229647 0.235751 -0.106787 -0.342835 0.002654 -0.203735 -0.191368 0.010577 -0.254030 -0.234056 -0.171584 -0.146884 -0.151688 0.019384 0.092411 0.113833 0.104570 0.127461 0.105791 0.101925 0.112180 0.115680 0.109584 0.098030 0.155719 0.123239 0.148887 0.151826 0.158364 0.145771 0.145522 0.149228
qa: -0.1049 -0.3606 -0.0436 -0.3730 0.3863 -0.2296 0.2358 -0.1068 -0.3428 0.0027 -0.2037 -0.1914 0.0106 -0.2540 -0.2341 -0.1716 -0.1469 -0.1517 0.0194 0.0924 0.1138 0.1046 0.1275 0.1058 0.1019 0.1122 0.1157 0.1096 0.0980 0.1557 0.1232 0.1489 0.1518 0.1584 0.1458 0.1455 0.1492
va: 1.2007 1.9022 2.7704 3.0751 3.8554 3.9107 3.8142 3.5943 3.9584 3.6000 3.9730 3.9608 4.0451 4.0196 3.9662 3.9374 3.9735 4.0029 3.9855 3.8215 1.0072 1.0107 0.9918 1.0035 1.0081 1.0050 1.0055 0.9954 0.9935 1.0155 1.0162 1.0015 1.0204 0.9924 1.0047 1.0059 0.9976
dispcorr: -0.018985239 hartree
energy: -1264.903217393683
dipole: 24.70559 -23.67769 1.02791 6.34413 -6.02073 0.32341 2.55403 -2.15672 0.39731
magnitude: 1.14849 au
magnitude: 2.91924 debye
