program: Orca
programVersion: 4.2.1
elementType: Cl O N N C C C C C C C C C C C C C C C C H H H H H H H H H H H H H H H H H
charge: 0
multiplicity: 1
keywords: wb97x-d3
keywords: def2-TZVPP
keywords: def2/J RIJCOSX GRIDX6 NOFINALGRIDX
keywords: grid4 nofinalgrid
keywords: scfconv7
keywords: smallprint printgap noloewdin
keywords: NOSOSCF
formula: C16H17ClN2O
InChI: InChI=1S/C16H17ClN2O/c1-16(13-4-3-9-18-11-13)10-15(20-19(16)2)12-5-7-14(17)8-6-12/h3-9,11,15H,10H2,1-2H3
37 atoms
Cl -5.982971 -0.334258 0.073761
O  0.584358 0.823264 0.964576
N  1.223666 1.558608 -0.05712
N  4.807769 -1.691237 -0.125217
C  1.833927 0.50443 -0.875215
C  0.724006 -0.560829 -0.931917
C  0.032002 -0.381072 0.423231
C  3.071369 -0.024311 -0.163928
C  2.243298 1.002053 -2.257211
C  -1.476017 -0.341999 0.347613
C  0.243126 2.381789 -0.747923
C  3.674105 0.622569 0.906368
C  3.693493 -1.179901 -0.630234
C  -2.223623 0.6407 0.986036
C  -2.149838 -1.33608 -0.358629
C  4.837807 0.097135 1.448084
C  -3.609343 0.649304 0.905273
C  -3.53245 -1.3439 -0.446323
C  5.367355 -1.056787 0.899824
C  -4.253143 -0.342837 0.186117
H  0.044423 -0.350248 -1.759543
H  1.098772 -1.572032 -1.073477
H  0.322541 -1.183145 1.10938
H  1.388754 1.332497 -2.846224
H  2.722061 0.195524 -2.811063
H  2.959077 1.821561 -2.187286
H  -0.270389 2.998337 -0.013404
H  -0.509517 1.834418 -1.324305
H  0.76464 3.057738 -1.42237
H  3.251316 1.529998 1.312118
H  3.271813 -1.7253 -1.468062
H  -1.734061 1.420378 1.55253
H  -1.594894 -2.121335 -0.857201
H  5.328837 0.578494 2.282397
H  -4.175004 1.426769 1.400348
H  -4.037337 -2.11995 -1.005106
H  6.277795 -1.488316 1.297802
elementType: Cl O N C H
totalener: -1264.88509508 hartree
nucrepener: 1630.65229554 hartree
electener: -2895.53739062 hartree
oneelecener: -4966.54135892 hartree
twoeener: 2071.00396830 hartree
cpcmener: -0.02479764 hartree
kineticenergy: 1260.66331546 hartree
xcener: -100.555772647088 hartree
chargesum: 0.0000000
charge: -0.104942 -0.355809 -0.006862 -0.373609 0.384915 -0.276763 0.269566 -0.141672 -0.301150 -0.009276 -0.229497 -0.142029 -0.042739 -0.205491 -0.254638 -0.168635 -0.149446 -0.150098 0.013502 0.094981 0.102810 0.123304 0.113149 0.102578 0.111034 0.116003 0.115862 0.098124 0.117203 0.143023 0.116826 0.145855 0.149052 0.156882 0.144533 0.145341 0.148113
qa: -0.1049 -0.3558 -0.0069 -0.3736 0.3849 -0.2768 0.2696 -0.1417 -0.3012 -0.0093 -0.2295 -0.1420 -0.0427 -0.2055 -0.2546 -0.1686 -0.1494 -0.1501 0.0135 0.0950 0.1028 0.1233 0.1131 0.1026 0.1110 0.1160 0.1159 0.0981 0.1172 0.1430 0.1168 0.1459 0.1491 0.1569 0.1445 0.1453 0.1481
va: 1.2005 1.9088 2.8402 3.0791 3.8305 3.9518 3.7679 3.6394 3.9031 3.5880 4.0034 3.9353 4.1147 3.9584 4.0119 3.9207 4.0051 3.9759 3.9785 3.8175 1.0130 1.0077 1.0037 0.9978 1.0014 1.0016 0.9990 0.9810 1.0005 1.0380 1.0153 1.0245 1.0008 0.9940 1.0064 1.0054 0.9981
dispcorr: -0.019112449 hartree
energy: -1264.904207529253
dipole: 22.31017 -22.25349 0.05669 5.89405 -5.36408 0.52997 -7.61417 6.73749 -0.87668
magnitude: 1.02599 au
magnitude: 2.60785 debye
