program: Orca
programVersion: 4.2.1
elementType: Cl O N N C C C C C C C C C C C C C C C C H H H H H H H H H H H H H H H H H
charge: 0
multiplicity: 1
keywords: wb97x-d3
keywords: def2-TZVPP
keywords: def2/J RIJCOSX GRIDX6 NOFINALGRIDX
keywords: grid4 nofinalgrid
keywords: scfconv7
keywords: smallprint printgap noloewdin
keywords: NOSOSCF
formula: C16H17ClN2O
InChI: InChI=1S/C16H17ClN2O/c1-16(13-4-3-9-18-11-13)10-15(20-19(16)2)12-5-7-14(17)8-6-12/h3-9,11,15H,10H2,1-2H3
37 atoms
Cl -5.824333 -1.29508 -0.697877
O  0.0182 1.864152 0.013044
N  1.406783 1.743175 -0.170311
N  4.753699 -1.492503 0.902972
C  1.602669 0.280759 -0.196952
C  0.681847 -0.203898 0.93552
C  -0.435245 0.853326 0.918353
C  3.060337 -0.083005 -0.051145
C  1.11825 -0.262946 -1.545798
C  -1.783419 0.343585 0.477287
C  2.074682 2.435481 0.923792
C  4.029561 0.534151 -0.839995
C  3.489806 -1.097977 0.794626
C  -2.418283 -0.620822 1.257428
C  -2.429404 0.804003 -0.66382
C  5.349788 0.138356 -0.728144
C  -3.655978 -1.131209 0.905338
C  -3.672691 0.303549 -1.0291
C  5.663314 -0.880066 0.160178
C  -4.275362 -0.662698 -0.243707
H  0.311285 -1.213848 0.765154
H  1.18597 -0.198347 1.901822
H  -0.547965 1.285138 1.920251
H  1.256179 -1.343843 -1.582617
H  1.682862 0.175776 -2.368991
H  0.06178 -0.061975 -1.72048
H  1.699588 3.457062 0.961916
H  3.1420 2.493978 0.721526
H  1.943554 1.982368 1.913721
H  3.758246 1.322761 -1.531359
H  2.780821 -1.632941 1.416443
H  -1.942716 -0.987484 2.159566
H  -1.974322 1.558627 -1.289859
H  6.12531 0.605206 -1.319802
H  -4.129263 -1.883232 1.522071
H  -4.160217 0.671847 -1.921671
H  6.688233 -1.216585 0.269169
elementType: Cl O N C H
totalener: -1264.89022217 hartree
nucrepener: 1620.58301355 hartree
electener: -2885.47323572 hartree
oneelecener: -4946.25179343 hartree
twoeener: 2060.77855771 hartree
cpcmener: -0.02170428 hartree
kineticenergy: 1260.64188941 hartree
xcener: -100.550192059928 hartree
chargesum: -0.0000000
charge: -0.102789 -0.348009 -0.039665 -0.363706 0.378351 -0.230884 0.227085 -0.098014 -0.341701 0.005613 -0.204633 -0.192764 0.005995 -0.253724 -0.232369 -0.169635 -0.144480 -0.146200 0.019291 0.090850 0.112879 0.103928 0.124430 0.105447 0.101258 0.112196 0.115865 0.108753 0.095023 0.155665 0.121025 0.146116 0.151032 0.154773 0.143207 0.143211 0.146581
qa: -0.1028 -0.3480 -0.0397 -0.3637 0.3784 -0.2309 0.2271 -0.0980 -0.3417 0.0056 -0.2046 -0.1928 0.0060 -0.2537 -0.2324 -0.1696 -0.1445 -0.1462 0.0193 0.0908 0.1129 0.1039 0.1244 0.1054 0.1013 0.1122 0.1159 0.1088 0.0950 0.1557 0.1210 0.1461 0.1510 0.1548 0.1432 0.1432 0.1466
va: 1.2027 1.9148 2.7774 3.0807 3.8650 3.9041 3.8322 3.5859 3.9576 3.6081 3.9746 3.9610 4.0508 4.0193 3.9691 3.9378 3.9780 3.9994 3.9886 3.8338 1.0074 1.0107 0.9910 1.0036 1.0088 1.0053 1.0054 0.9953 0.9932 1.0156 1.0154 1.0021 1.0208 0.9936 1.0055 1.0064 0.9978
dispcorr: -0.018982092 hartree
energy: -1264.909204266141
dipole: 24.67787 -23.69862 0.97925 6.39615 -6.03536 0.36079 2.62221 -2.24521 0.37701
magnitude: 1.10961 au
magnitude: 2.82040 debye
