program: Orca
programVersion: 4.2.1
elementType: Cl O N N C C C C C C C C C C C C C C C C H H H H H H H H H H H H H H H H H
charge: 0
multiplicity: 1
keywords: wb97x-d3
keywords: def2-TZVPP
keywords: def2/J RIJCOSX GRIDX6 NOFINALGRIDX
keywords: grid4 nofinalgrid
keywords: scfconv7
keywords: smallprint printgap noloewdin
keywords: NOSOSCF
formula: C16H17ClN2O
InChI: InChI=1S/C16H17ClN2O/c1-16(13-4-3-9-18-11-13)10-15(20-19(16)2)12-5-7-14(17)8-6-12/h3-9,11,15H,10H2,1-2H3
37 atoms
Cl -6.0368 -1.022443 -0.429586
O  0.004165 1.554791 0.712357
N  1.412508 1.507772 0.584695
N  5.128321 -0.941009 -1.073374
C  1.649935 0.366357 -0.317372
C  0.659144 -0.653292 0.287757
C  -0.349198 0.238591 1.052076
C  3.089271 -0.073926 -0.142787
C  1.284778 0.648529 -1.776795
C  -1.783684 -0.021045 0.690571
C  1.852501 2.801901 0.130849
C  3.677271 -0.076646 1.120859
C  3.876247 -0.519674 -1.198794
C  -2.470725 0.750197 -0.238668
C  -2.439693 -1.099575 1.274206
C  4.981687 -0.509756 1.263448
C  -3.779371 0.447173 -0.583432
C  -3.74273 -1.419148 0.933616
C  5.667174 -0.933208 0.13304
C  -4.407939 -0.639032 0.000995
H  0.179796 -1.25025 -0.487899
H  1.158724 -1.342679 0.967414
H  -0.217345 0.083462 2.131815
H  0.278217 1.060381 -1.846061
H  1.292205 -0.268883 -2.364868
H  1.971014 1.351314 -2.250422
H  1.678152 3.535786 0.916386
H  1.361345 3.149046 -0.78516
H  2.926434 2.74966 -0.045993
H  3.112933 0.273024 1.975223
H  3.483456 -0.543852 -2.208627
H  -1.991823 1.605069 -0.695248
H  -1.92721 -1.706199 2.011871
H  5.464029 -0.518654 2.23145
H  -4.30757 1.057276 -1.303127
H  -4.239334 -2.262095 1.393632
H  6.691664 -1.281367 0.207422
totalener: -1264.87173511 hartree
nucrepener: 1610.25591789 hartree
electener: -2875.12765301 hartree
oneelecener: -4925.32026682 hartree
twoeener: 2050.19261381 hartree
kineticenergy: 1260.68545939 hartree
xcener: -100.553926561284 hartree
chargesum: -0.0000000
charge: -0.082165 -0.292516 -0.049549 -0.292201 0.432190 -0.144693 0.164396 -0.198233 -0.381620 0.014161 -0.215266 -0.128931 -0.034462 -0.164338 -0.191306 -0.143080 -0.146507 -0.134037 0.021107 0.093286 0.092962 0.096974 0.089804 0.112953 0.097503 0.110627 0.115877 0.087171 0.106261 0.138246 0.098147 0.129478 0.112716 0.124435 0.120992 0.120544 0.119074
qa: -0.0822 -0.2925 -0.0495 -0.2922 0.4322 -0.1447 0.1644 -0.1982 -0.3816 0.0142 -0.2153 -0.1289 -0.0345 -0.1643 -0.1913 -0.1431 -0.1465 -0.1340 0.0211 0.0933 0.0930 0.0970 0.0898 0.1130 0.0975 0.1106 0.1159 0.0872 0.1063 0.1382 0.0981 0.1295 0.1127 0.1244 0.1210 0.1205 0.1191
va: 1.2248 1.9686 2.7394 3.1199 3.6370 3.8094 3.9086 3.6326 3.9566 3.6510 3.9714 3.9526 4.1168 3.9989 4.0419 3.9173 4.0381 4.0182 4.0092 3.9215 1.0158 1.0086 1.0095 1.0123 1.0044 0.9934 0.9994 0.9986 0.9934 1.0350 1.0113 1.0269 1.0136 1.0031 1.0135 1.0125 1.0009
dispcorr: -0.018600758 hartree
energy: -1264.890335871328
dipole: 24.61711 -24.24011 0.37700 7.04251 -6.90084 0.14167 -0.60988 1.09685 0.48697
magnitude: 0.63193 au
magnitude: 1.60624 debye
