program: Orca
programVersion: 4.2.1
elementType: Cl O N N C C C C C C C C C C C C C C C C H H H H H H H H H H H H H H H H H
charge: 0
multiplicity: 1
keywords: wb97x-d3
keywords: def2-TZVPP
keywords: def2/J RIJCOSX GRIDX6 NOFINALGRIDX
keywords: grid4 nofinalgrid
keywords: scfconv7
keywords: smallprint printgap noloewdin
keywords: NOSOSCF
formula: C16H17ClN2O
InChI: InChI=1S/C16H17ClN2O/c1-16(13-4-3-9-18-11-13)10-15(20-19(16)2)12-5-7-14(17)8-6-12/h3-9,11,15H,10H2,1-2H3
37 atoms
Cl -6.0445 -0.052012 -0.156125
O  0.525503 0.859828 1.019116
N  0.923311 1.179625 -0.305875
N  4.433677 -0.727008 1.624317
C  1.589308 -0.047058 -0.791229
C  0.623153 -1.11255 -0.235643
C  -0.125655 -0.377547 0.900642
C  3.001419 -0.209718 -0.243014
C  1.546804 -0.026307 -2.314341
C  -1.608006 -0.256064 0.637241
C  1.720946 2.377277 -0.224659
C  4.130657 0.097979 -0.994396
C  3.236077 -0.621726 1.071682
C  -2.402054 -1.394756 0.727506
C  -2.211351 0.949619 0.306811
C  5.391408 -0.012806 -0.431053
C  -3.764398 -1.344685 0.485837
C  -3.574985 1.015653 0.061274
C  5.490987 -0.426256 0.886099
C  -4.344636 -0.131786 0.149781
H  -0.072862 -1.434514 -1.00975
H  1.149808 -2.00044 0.112403
H  0.016483 -0.887119 1.859205
H  0.513688 0.065928 -2.644644
H  1.96368 -0.943816 -2.730027
H  2.097955 0.812153 -2.741005
H  2.10672 2.601457 -1.21886
H  2.56406 2.310715 0.47109
H  1.084381 3.209522 0.073944
H  4.043307 0.420207 -2.023408
H  2.412803 -0.88925 1.723512
H  -1.954628 -2.345722 0.995614
H  -1.619915 1.851058 0.235742
H  6.279192 0.216389 -1.004738
H  -4.369506 -2.237453 0.562569
H  -4.036303 1.958943 -0.197603
H  6.45903 -0.524057 1.364983
totalener: -1264.86914980 hartree
nucrepener: 1630.84757079 hartree
electener: -2895.71672059 hartree
oneelecener: -4966.66771428 hartree
twoeener: 2070.95099369 hartree
kineticenergy: 1260.67531974 hartree
xcener: -100.551510358882 hartree
chargesum: 0.0000000
charge: -0.086307 -0.291502 -0.065736 -0.282946 0.499106 -0.289386 0.290793 -0.198366 -0.334870 -0.012229 -0.201152 -0.148857 -0.024717 -0.268987 -0.170506 -0.120694 -0.121827 -0.124506 0.007100 0.090410 0.103422 0.112023 0.104321 0.101305 0.118215 0.079401 0.093769 0.101595 0.108089 0.120054 0.095478 0.115033 0.122016 0.123252 0.119945 0.118687 0.118575
qa: -0.0863 -0.2915 -0.0657 -0.2829 0.4991 -0.2894 0.2908 -0.1984 -0.3349 -0.0122 -0.2012 -0.1489 -0.0247 -0.2690 -0.1705 -0.1207 -0.1218 -0.1245 0.0071 0.0904 0.1034 0.1120 0.1043 0.1013 0.1182 0.0794 0.0938 0.1016 0.1081 0.1201 0.0955 0.1150 0.1220 0.1233 0.1199 0.1187 0.1186
va: 1.2205 1.9692 2.7775 3.1203 3.4578 3.9363 3.7833 3.6832 3.9563 3.6376 3.9935 3.9659 4.0874 4.0683 4.0209 3.9268 4.0058 4.0067 4.0248 3.9097 0.9959 1.0051 0.9927 1.0180 0.9975 1.0057 0.9943 0.9977 1.0002 1.0106 1.0265 1.0125 1.0258 1.0024 1.0130 1.0138 1.0004
dispcorr: -0.019121466 hartree
energy: -1264.888271267944
dipole: 26.01966 -25.07209 0.94757 2.02312 -2.08234 -0.05922 -6.71931 5.67632 -1.04300
magnitude: 1.41040 au
magnitude: 3.58496 debye
