program: Orca
programVersion: 4.2.1
elementType: Cl Cl O N N C C C C C C C C C C C C C C H H H H H H H H H H H H
charge: 0
multiplicity: 1
keywords: wb97x-d3
keywords: def2-TZVPP
keywords: def2/J RIJCOSX GRIDX6 NOFINALGRIDX
keywords: grid4 nofinalgrid
keywords: scfconv7
keywords: smallprint printgap noloewdin
keywords: NOSOSCF
formula: C14H12Cl2N2O
InChI: InChI=1S/C14H12Cl2N2O/c1-19-18-14(7-10-3-2-6-17-9-10)12-5-4-11(15)8-13(12)16/h2-6,8-9H,7H2,1H3
31 atoms
Cl -0.546108 -1.398113 -2.670986
Cl -4.463252 0.998834 0.096106
O  0.580385 -2.877725 0.932847
N  1.566055 -2.155083 0.32816
N  3.61676 2.072913 1.790293
C  2.148621 -0.167733 -0.846271
C  1.144834 -1.071221 -0.187878
C  -0.258102 -0.603089 -0.108984
C  2.379261 1.053493 0.002319
C  -1.108391 -0.672304 -1.205378
C  -0.746256 -0.034293 1.062997
C  1.594493 2.19419 -0.110728
C  3.372474 1.054725 0.975025
C  -2.404369 -0.18447 -1.16063
C  -2.036081 0.461727 1.138864
C  -2.85141 0.381697 0.021186
C  1.834857 3.264132 0.736512
C  2.8540 3.154648 1.667815
C  1.131188 -4.02064 1.562879
H  3.081672 -0.713165 -0.989469
H  1.788648 0.128301 -1.833887
H  -0.104248 0.033432 1.930922
H  0.810758 2.251357 -0.85624
H  4.006736 0.182301 1.094243
H  -3.048615 -0.249821 -2.026155
H  -2.395356 0.904889 2.056653
H  1.246078 4.168756 0.676369
H  3.065751 3.975558 2.34244
H  0.295426 -4.542923 2.024082
H  1.849246 -3.749626 2.339539
H  1.61304 -4.688431 0.8457
elementType: Cl O N C H
totalener: -1645.85682901 hartree
nucrepener: 1618.37790353 hartree
electener: -3264.23473254 hartree
oneelecener: -5472.36075560 hartree
twoeener: 2208.12602306 hartree
cpcmener: -0.02224487 hartree
kineticenergy: 1641.45750832 hartree
xcener: -112.967767722253 hartree
chargesum: -0.0000000
charge: -0.069396 -0.082357 -0.235522 -0.115202 -0.368649 -0.026517 0.091374 -0.046665 0.018629 0.063214 -0.143529 -0.162318 -0.017868 -0.167168 -0.160329 0.118392 -0.147451 0.008290 -0.113309 0.099134 0.113124 0.151884 0.150227 0.125576 0.128469 0.150639 0.160265 0.149010 0.116331 0.105463 0.106262
qa: -0.0694 -0.0824 -0.2355 -0.1152 -0.3686 -0.0265 0.0914 -0.0467 0.0186 0.0632 -0.1435 -0.1623 -0.0179 -0.1672 -0.1603 0.1184 -0.1475 0.0083 -0.1133 0.0991 0.1131 0.1519 0.1502 0.1256 0.1285 0.1506 0.1603 0.1490 0.1163 0.1055 0.1063
va: 1.2580 1.2211 1.9340 2.9381 3.0608 3.8204 3.9005 3.5821 3.5529 3.9279 3.9242 3.9515 4.0733 4.1038 4.0129 3.8461 3.9041 3.9928 3.8892 1.0349 1.0179 1.0004 0.9968 1.0177 1.0204 1.0023 0.9899 0.9980 0.9936 0.9941 0.9944
dispcorr: -0.015820849 hartree
energy: -1645.872649857409
dipole: 18.17629 -18.81642 -0.64013 -1.49295 1.81319 0.32024 10.51105 -10.70414 -0.19309
magnitude: 0.74135 au
magnitude: 1.88436 debye
