program: Gaussian 09
title: 000034370
version: EM64L-G09RevD.01
frameworkgroup: C1[X(C9H18N2)]
method: RPBEPBE
basis: SDD
operation: Freq
keyword: #pfreq=noraman
keyword: PBEPBE/SDD
title: #p freq=noraman PBEPBE/SDD
converged: YES YES NO NO
title: Mulliken charges:
elementType: N N C C C C C C C C C H H H H H H H H H H H H H H H H H H
charge: -0.454592 -0.110883 -0.380432 -0.354518 -0.469127 -0.354188 0.213432 -0.354337 -0.366876 -0.481526 -0.695239 0.179999 0.219866 0.197096 0.185294 0.209195 0.239030 0.192031 0.184689 0.197091 0.194086 0.218168 0.218915 0.287963 0.224838 0.224284 0.216097 0.208765 0.210880
chargesum: 0.00000
title: Mulliken charges with hydrogens summed into heavy atoms:
elementType: N N C C C C C C C C C
charge: -0.166629 -0.110883 0.019432 0.027872 -0.020903 0.022532 0.213432 0.036839 0.070207 -0.032404 -0.059497
polarizability: 1.41920194e+02 3.16067972e-01 9.99877211e+01 6.51083456e+00 -3.88061166e+00 8.90606975e+01
1716.lowfreq: -40.7522 -13.7883 -7.1435 -0.0007 -0.0006 0.0004 3.7377 30.0845 37.3873
frequency: -39.2314 29.7778 37.3431 56.8152 70.0363 112.3060 132.0119 145.4693 227.3319 233.7422 257.3361 306.7599 326.7236 422.7283 433.3682 613.5831 713.4985 719.7339 729.0268 734.2144 781.2612 824.4202 868.5127 887.2087 893.6317 924.5311 960.9360 983.8907 1008.3100 1023.3695 1047.8304 1066.0434 1076.9243 1080.6938 1101.4103 1115.5452 1166.3626 1190.9639 1211.4871 1225.4059 1231.4488 1250.9654 1269.9639 1277.4852 1281.6379 1285.9812 1292.6543 1304.4106 1328.8165 1348.9633 1353.3048 1389.1967 1443.2976 1456.2391 1461.7580 1464.9372 1470.1970 1472.5730 1477.1963 1481.1349 1487.9182 1507.7584 1603.8605 2952.0428 2956.0709 2965.1839 2967.6045 2969.0886 2971.7862 2976.8731 2988.9944 3003.2892 3004.6389 3010.3857 3023.4888 3039.2515 3054.4013 3068.0224 3070.6276 3076.8570 3616.2482
redmass: 1.8430 3.1535 2.1371 3.3491 2.7441 1.8014 2.2113 3.2243 1.1341 4.0010 2.4188 1.2775 2.5922 2.7205 3.2005 3.7807 2.7602 1.1600 2.7591 1.5420 1.2295 1.2084 1.3359 2.1785 3.8030 3.4578 2.1470 1.6050 3.8773 2.9794 3.7069 2.6854 1.7127 2.0653 1.4754 2.3936 1.1405 1.6644 1.0855 1.3073 1.4096 1.3333 1.4205 1.3077 1.0914 1.1785 1.1114 1.3971 1.4835 1.5314 1.6685 1.2164 2.1082 1.1240 1.0731 1.0766 1.1027 1.0791 1.0425 1.0816 1.0878 1.1419 6.7669 1.0589 1.0592 1.0605 1.0568 1.0598 1.0367 1.0677 1.0956 1.0602 1.0989 1.1084 1.1017 1.1029 1.1068 1.1006 1.0993 1.0964 1.0800
irintensity: 15.6802 0.4488 0.4938 0.2822 0.6165 0.1638 0.1504 1.3502 0.0315 7.0688 53.1569 83.0979 5.7759 1.9596 0.6110 1.4453 0.5088 13.0711 1.3540 0.4467 0.9691 1.4976 6.4011 3.4626 4.7798 26.7644 1.7747 3.4245 2.2904 2.6053 11.8425 0.4752 0.3787 0.0425 2.3349 13.5119 2.0205 0.8186 0.1476 3.2704 7.7276 6.3611 53.7621 1.8455 6.3132 7.4700 3.3030 1.3687 0.6569 1.5975 0.4026 11.2228 89.6981 5.7221 1.5359 1.5091 0.8229 3.2483 12.2922 5.4984 24.0542 15.1163 119.1006 0.3146 9.3550 7.4490 84.8970 102.0539 35.3343 42.2876 5.7693 82.9769 2.0476 22.6192 3.0472 88.3688 56.5839 87.3399 54.3569 37.1715 14.4224
temp: 298.150 k
press: 1.00000 atm
elementType: 7 7 6 6 6 6 6 6 6 6 6 1 1 1 1 1 1 1 1 1 1 1 1 1 1 1 1 1 1
symmnumber: 1
zpe: 678265.3 jmol-1
zpe.correction: 0.258338 hartree
zpe.thermalcorrener: 0.270951 hartree
zpe.thermalcorrenthalpy: 0.271895 hartree
zpe.thermalcorrgfe: 0.217325 hartree
zpe.sumelectzpe: -462.350535 hartree
zpe.sumelectthermal: -462.337922 hartree
zpe.sumelectthermalent: -462.336977 hartree
zpe.sumelectthermalfe: -462.391548 hartree
dipole: -0.7326 2.9077 -1.3519
dipole: 3.2892
quadrupole: -67.6970 -71.4387 -68.9997
quadrupole: 9.8472 -1.9223 0.2439
quadrupole: 1.6815 -2.0602 0.3787 9.8472 -1.9223 0.2439
hfenergy: -462.6088727 hartree
pointgroup: C01 [X(C9H18N2)]
dipole: -0.2726536 1.2482081 0.2055438 debye
polarizability: 141.8480417|-3.911602|100.2212456|5.5186064|3.6074457|88.899325 unknown
InChI: InChI=1S/C9H18N2/c1-2-3-4-5-6-9-10-7-8-11-9/h10H,2-8H2,1H3
charge 0 multiplicity 1
29 atoms
N  2.455456 1.049463 0.070698
N  2.877441 -1.194047 -0.198291
C  -0.514429 0.003517 0.028933
C  -1.910444 -0.221062 -0.593266
C  0.632841 -0.377562 -0.944758
C  -3.068621 0.156089 0.357771
C  2.012029 -0.209433 -0.354674
C  -4.465791 -0.051281 -0.271305
C  3.828774 0.956291 0.608114
C  4.10963 -0.587775 0.422629
C  -5.618601 0.328939 0.682886
H  -0.420317 1.066146 0.334766
H  -0.416599 -0.597673 0.954367
H  -2.01062 -1.285582 -0.890181
H  -1.996192 0.37206 -1.528274
H  0.546494 0.23391 -1.866446
H  0.536403 -1.435672 -1.241927
H  -2.992986 -0.446292 1.286987
H  -2.962034 1.217571 0.666028
H  -4.572462 -1.111501 -0.578964
H  -4.538763 0.55068 -1.200204
H  3.876167 1.266526 1.66991
H  4.537203 1.582756 0.031951
H  1.912518 1.907843 0.027824
H  4.977207 -0.770885 -0.236845
H  4.313353 -1.086166 1.387885
H  -6.605488 0.174328 0.209028
H  -5.55052 1.391916 0.982804
H  -5.587448 -0.281302 1.605353
