program: Orca
programVersion: 4.2.1
elementType: Cl Cl O N N C C C C C C C C C C C C C C H H H H H H H H H H H H
charge: 0
multiplicity: 1
keywords: wb97x-d3
keywords: def2-TZVPP
keywords: def2/J RIJCOSX GRIDX6 NOFINALGRIDX
keywords: grid4 nofinalgrid
keywords: scfconv7
keywords: smallprint printgap noloewdin
keywords: NOSOSCF
formula: C14H12Cl2N2O
InChI: InChI=1S/C14H12Cl2N2O/c1-19-18-14(7-10-3-2-6-17-9-10)12-5-4-11(15)8-13(12)16/h2-6,8-9H,7H2,1H3
31 atoms
Cl -0.426439 -1.385538 -2.675186
Cl -4.350415 1.141789 -0.037054
O  0.504036 -2.97626 0.961714
N  1.533441 -2.271942 0.418462
N  3.278708 2.172502 1.938125
C  2.233825 -0.293651 -0.699288
C  1.170963 -1.172593 -0.100949
C  -0.219659 -0.659223 -0.082776
C  2.343042 0.996345 0.06754
C  -1.019983 -0.666796 -1.217893
C  -0.738436 -0.094452 1.078217
C  1.602841 2.121959 -0.271191
C  3.161771 1.085174 1.188509
C  -2.292947 -0.118407 -1.221143
C  -2.005829 0.459442 1.106803
C  -2.769681 0.444001 -0.049452
C  1.712631 3.263478 0.506248
C  2.56269 3.238434 1.600281
C  0.993708 -4.154654 1.573287
H  3.183217 -0.830802 -0.687062
H  1.99509 -0.083576 -1.74467
H  -0.134831 -0.072849 1.975923
H  0.950542 2.11147 -1.136382
H  3.755772 0.226934 1.488991
H  -2.897165 -0.133543 -2.117561
H  -2.386724 0.89976 2.017514
H  1.152287 4.157647 0.269528
H  2.671846 4.115828 2.227865
H  0.1261 -4.65969 1.99463
H  1.697908 -3.932922 2.37877
H  1.47356 -4.819779 0.850928
elementType: Cl O N C H
totalener: -1645.86324303 hartree
nucrepener: 1624.10486162 hartree
electener: -3269.96810465 hartree
oneelecener: -5483.78442652 hartree
twoeener: 2213.81632187 hartree
cpcmener: -0.01879099 hartree
kineticenergy: 1641.46113623 hartree
xcener: -112.968145626259 hartree
chargesum: -0.0000000
charge: -0.068606 -0.081257 -0.223204 -0.107181 -0.358521 -0.038528 0.082926 -0.043677 0.026267 0.055116 -0.129931 -0.156690 -0.018193 -0.161345 -0.169622 0.119171 -0.147707 0.009235 -0.115548 0.099966 0.110968 0.145540 0.143059 0.126239 0.126720 0.147857 0.156983 0.146109 0.114255 0.104216 0.105385
qa: -0.0686 -0.0813 -0.2232 -0.1072 -0.3585 -0.0385 0.0829 -0.0437 0.0263 0.0551 -0.1299 -0.1567 -0.0182 -0.1613 -0.1696 0.1192 -0.1477 0.0092 -0.1155 0.1000 0.1110 0.1455 0.1431 0.1262 0.1267 0.1479 0.1570 0.1461 0.1143 0.1042 0.1054
va: 1.2580 1.2222 1.9456 2.9537 3.0649 3.8221 3.9004 3.6011 3.5354 3.9309 3.9273 3.9542 4.0706 4.0995 4.0217 3.8528 3.9093 3.9949 3.8949 1.0364 1.0172 1.0039 0.9990 1.0164 1.0209 1.0033 0.9907 0.9981 0.9940 0.9942 0.9942
dispcorr: -0.016016912 hartree
energy: -1645.879259941019
dipole: 17.35493 -17.82929 -0.47436 -2.34062 2.49893 0.15831 10.67482 -10.95999 -0.28517
magnitude: 0.57567 au
magnitude: 1.46325 debye
