program: Orca
programVersion: 4.2.1
elementType: Cl Cl O N N C C C C C C C C C C C C C C H H H H H H H H H H H H
charge: 0
multiplicity: 1
keywords: wb97x-d3
keywords: def2-TZVPP
keywords: def2/J RIJCOSX GRIDX6 NOFINALGRIDX
keywords: grid4 nofinalgrid
keywords: scfconv7
keywords: smallprint printgap noloewdin
keywords: NOSOSCF
formula: C14H12Cl2N2O
InChI: InChI=1S/C14H12Cl2N2O/c1-19-18-14(7-10-3-2-6-17-9-10)12-5-4-11(15)8-13(12)16/h2-6,8-9H,7H2,1H3
31 atoms
Cl -0.890601 -0.106113 -2.34947
Cl -5.31043 -0.939186 0.560861
O  0.875677 -2.01204 -0.409476
N  1.440385 -0.822116 -0.068024
N  4.450768 2.273401 -0.668135
C  1.069961 1.406373 0.715365
C  0.590984 0.044047 0.30019
C  -0.870129 -0.200448 0.350487
C  2.555048 1.579962 0.628213
C  -1.638668 -0.295133 -0.805343
C  -1.513606 -0.326622 1.576262
C  3.400422 1.193222 1.659734
C  3.143304 2.11394 -0.511843
C  -3.004706 -0.517799 -0.754652
C  -2.877143 -0.555719 1.657215
C  -3.608399 -0.651804 0.485113
C  4.767813 1.35614 1.511051
C  5.244323 1.897458 0.326991
C  1.866283 -2.893868 -0.898054
H  0.561556 2.148398 0.091747
H  0.721705 1.601243 1.734856
H  -0.938138 -0.255104 2.490395
H  2.994277 0.771427 2.571443
H  2.518467 2.432115 -1.341395
H  -3.584395 -0.587035 -1.664571
H  -3.356373 -0.659065 2.620628
H  5.454571 1.068221 2.295466
H  6.309413 2.035417 0.177304
H  2.348125 -2.507332 -1.799311
H  1.351776 -3.82091 -1.145598
H  2.631354 -3.104664 -0.146585
elementType: Cl O N C H
totalener: -1645.86320452 hartree
nucrepener: 1587.10781316 hartree
electener: -3232.97101767 hartree
oneelecener: -5410.25210338 hartree
twoeener: 2177.28108571 hartree
cpcmener: -0.02160302 hartree
kineticenergy: 1641.46070052 hartree
xcener: -112.968648655546 hartree
chargesum: -0.0000000
charge: -0.068219 -0.082279 -0.225919 -0.126585 -0.363090 -0.045909 0.101426 -0.006381 0.051289 0.045965 -0.130151 -0.170463 -0.028344 -0.167679 -0.183613 0.116891 -0.151302 0.008908 -0.118953 0.116533 0.116362 0.151153 0.145297 0.119316 0.126490 0.147007 0.155342 0.144968 0.101944 0.114192 0.105805
qa: -0.0682 -0.0823 -0.2259 -0.1266 -0.3631 -0.0459 0.1014 -0.0064 0.0513 0.0460 -0.1302 -0.1705 -0.0283 -0.1677 -0.1836 0.1169 -0.1513 0.0089 -0.1190 0.1165 0.1164 0.1512 0.1453 0.1193 0.1265 0.1470 0.1553 0.1450 0.1019 0.1142 0.1058
va: 1.2543 1.2213 1.9453 2.8745 3.0637 3.7784 3.8754 3.6711 3.5823 3.9542 3.9507 3.9889 4.0961 4.0862 4.0264 3.8536 3.9001 3.9942 3.9069 1.0114 1.0072 0.9992 1.0037 1.0154 1.0217 1.0049 0.9922 0.9985 0.9944 0.9936 0.9946
dispcorr: -0.014529861 hartree
energy: -1645.877734376996
dipole: 24.22891 -24.58882 -0.35991 0.55712 -0.95346 -0.39634 7.89325 -6.19343 1.69982
magnitude: 1.78214 au
magnitude: 4.52984 debye
