program: Orca
programVersion: 4.2.1
elementType: Cl Cl O N N C C C C C C C C C C C C C C H H H H H H H H H H H H
charge: 0
multiplicity: 1
keywords: wb97x-d3
keywords: def2-TZVPP
keywords: def2/J RIJCOSX GRIDX6 NOFINALGRIDX
keywords: grid4 nofinalgrid
keywords: scfconv7
keywords: smallprint printgap noloewdin
keywords: NOSOSCF
formula: C14H12Cl2N2O
InChI: InChI=1S/C14H12Cl2N2O/c1-19-18-14(7-10-3-2-6-17-9-10)12-5-4-11(15)8-13(12)16/h2-6,8-9H,7H2,1H3
31 atoms
Cl -0.660472 -0.835736 -2.41269
Cl -5.341502 -0.78705 0.193785
O  0.874158 -2.030486 0.166781
N  1.432261 -0.790601 0.191104
N  4.33391 2.16429 1.928838
C  1.045757 1.569696 0.217328
C  0.57438 0.142922 0.194928
C  -0.890016 -0.085427 0.172822
C  2.522364 1.723491 0.417512
C  -1.550315 -0.544824 -0.962005
C  -1.645714 0.164641 1.312635
C  3.430709 1.528806 -0.61589
C  3.038556 2.043038 1.667016
C  -2.91872 -0.759644 -0.970888
C  -3.013866 -0.048134 1.335793
C  -3.635498 -0.512082 0.188643
C  4.784949 1.654513 -0.357595
C  5.187062 1.967592 0.932444
C  1.88365 -3.010515 0.030021
H  0.731834 2.041741 -0.719831
H  0.502187 2.103683 1.002534
H  -1.155208 0.522476 2.208916
H  3.083879 1.282148 -1.612178
H  2.362751 2.207055 2.5013
H  -3.41395 -1.115432 -1.86375
H  -3.580004 0.143351 2.236519
H  5.519679 1.511034 -1.138211
H  6.240721 2.070288 1.167058
H  1.375938 -3.973774 0.038785
H  2.597192 -2.979797 0.857304
H  2.4259 -2.907585 -0.913169
elementType: Cl O N C H
totalener: -1645.86299368 hartree
nucrepener: 1585.72353361 hartree
electener: -3231.58652729 hartree
oneelecener: -5407.36627943 hartree
twoeener: 2175.77975215 hartree
cpcmener: -0.02092094 hartree
kineticenergy: 1641.46025276 hartree
xcener: -112.968750427681 hartree
chargesum: 0.0000000
charge: -0.070045 -0.082243 -0.224790 -0.127472 -0.365131 -0.032295 0.105838 -0.010859 0.037493 0.054864 -0.137112 -0.167819 -0.021745 -0.170034 -0.183314 0.118644 -0.153078 0.011150 -0.116458 0.117190 0.108687 0.152988 0.139997 0.121981 0.126640 0.146289 0.154631 0.145567 0.114169 0.106372 0.099899
qa: -0.0700 -0.0822 -0.2248 -0.1275 -0.3651 -0.0323 0.1058 -0.0109 0.0375 0.0549 -0.1371 -0.1678 -0.0217 -0.1700 -0.1833 0.1186 -0.1531 0.0111 -0.1165 0.1172 0.1087 0.1530 0.1400 0.1220 0.1266 0.1463 0.1546 0.1456 0.1142 0.1064 0.0999
va: 1.2514 1.2214 1.9411 2.8852 3.0623 3.7801 3.8764 3.6589 3.6012 3.9396 3.9584 3.9801 4.0809 4.0890 4.0259 3.8530 3.9027 3.9907 3.9050 1.0086 1.0119 0.9986 1.0092 1.0123 1.0221 1.0051 0.9922 0.9983 0.9938 0.9953 0.9947
dispcorr: -0.014528627 hartree
energy: -1645.877522303348
dipole: 23.62426 -23.98074 -0.35647 2.99881 -2.99324 0.00557 6.51661 -7.08004 -0.56343
magnitude: 0.66675 au
magnitude: 1.69474 debye
