program: Orca
programVersion: 4.2.1
elementType: Cl Cl O N N C C C C C C C C C C C C C C H H H H H H H H H H H H
charge: 0
multiplicity: 1
keywords: wb97x-d3
keywords: def2-TZVPP
keywords: def2/J RIJCOSX GRIDX6 NOFINALGRIDX
keywords: grid4 nofinalgrid
keywords: scfconv7
keywords: smallprint printgap noloewdin
keywords: NOSOSCF
formula: C14H12Cl2N2O
InChI: InChI=1S/C14H12Cl2N2O/c1-19-18-14(7-10-3-2-6-17-9-10)12-5-4-11(15)8-13(12)16/h2-6,8-9H,7H2,1H3
31 atoms
Cl -0.596661 0.874438 -1.979115
Cl -5.347373 -0.775297 -0.122816
O  0.807825 -2.362058 0.087598
N  1.398204 -1.186791 0.442456
N  4.847517 1.073649 1.14977
C  1.090394 1.115732 1.010284
C  0.575243 -0.231769 0.573585
C  -0.888812 -0.37958 0.394149
C  2.521571 1.369605 0.64358
C  -1.529361 0.114472 -0.735191
C  -1.663401 -1.01403 1.359793
C  2.861097 2.057959 -0.513343
C  3.564661 0.902838 1.436567
C  -2.899071 0.003122 -0.909883
C  -3.034056 -1.13897 1.214846
C  -3.637868 -0.626647 0.077212
C  4.198689 2.246377 -0.823422
C  5.154086 1.730906 0.037135
C  1.775981 -3.390646 0.022522
H  0.453028 1.893783 0.586764
H  0.952536 1.1878 2.094483
H  -1.187697 -1.412549 2.246267
H  2.088602 2.44951 -1.164135
H  3.345258 0.366917 2.354772
H  -3.374955 0.392997 -1.798859
H  -3.6193 -1.633824 1.977282
H  4.496097 2.783073 -1.714077
H  6.209551 1.857122 -0.177007
H  2.542398 -3.185007 -0.728517
H  1.237796 -4.293386 -0.261839
H  2.258114 -3.558675 0.988701
elementType: Cl O N C H
totalener: -1645.86195033 hartree
nucrepener: 1590.17910279 hartree
electener: -3236.04105312 hartree
oneelecener: -5416.28420680 hartree
twoeener: 2180.24315368 hartree
cpcmener: -0.02053984 hartree
kineticenergy: 1641.45579953 hartree
xcener: -112.967648524928 hartree
chargesum: -0.0000000
charge: -0.071674 -0.081578 -0.225260 -0.126237 -0.362069 -0.070182 0.115220 0.005777 0.074505 0.010012 -0.120570 -0.168488 -0.026484 -0.163541 -0.173808 0.114218 -0.157438 0.006096 -0.116966 0.116409 0.119774 0.148543 0.134572 0.120271 0.128415 0.146298 0.156536 0.145014 0.105624 0.114067 0.102946
qa: -0.0717 -0.0816 -0.2253 -0.1262 -0.3621 -0.0702 0.1152 0.0058 0.0745 0.0100 -0.1206 -0.1685 -0.0265 -0.1635 -0.1738 0.1142 -0.1574 0.0061 -0.1170 0.1164 0.1198 0.1485 0.1346 0.1203 0.1284 0.1463 0.1565 0.1450 0.1056 0.1141 0.1029
va: 1.2583 1.2222 1.9334 2.9137 3.0612 3.8132 3.8603 3.6053 3.5568 3.9922 3.9455 3.9817 4.0889 4.0835 4.0081 3.8565 3.9207 3.9950 3.9015 1.0048 1.0074 1.0047 1.0142 1.0190 1.0199 1.0047 0.9913 0.9983 0.9939 0.9942 0.9938
dispcorr: -0.014832040 hartree
energy: -1645.876782368394
dipole: 22.40503 -23.28725 -0.88222 -2.95423 3.08399 0.12976 6.98854 -6.92249 0.06605
magnitude: 0.89416 au
magnitude: 2.27276 debye
