program: Orca
programVersion: 4.2.1
elementType: Cl Cl O N N C C C C C C C C C C C C C C H H H H H H H H H H H H
charge: 0
multiplicity: 1
keywords: wb97x-d3
keywords: def2-TZVPP
keywords: def2/J RIJCOSX GRIDX6 NOFINALGRIDX
keywords: grid4 nofinalgrid
keywords: scfconv7
keywords: smallprint printgap noloewdin
keywords: NOSOSCF
formula: C14H12Cl2N2O
InChI: InChI=1S/C14H12Cl2N2O/c1-19-18-14(7-10-3-2-6-17-9-10)12-5-4-11(15)8-13(12)16/h2-6,8-9H,7H2,1H3
31 atoms
Cl -0.843845 1.109984 -1.822466
Cl -5.320964 -0.914359 0.322444
O  0.843453 -2.294379 -0.386831
N  1.449992 -1.163171 0.069468
N  4.113377 2.387562 -0.884518
C  1.164932 1.024307 0.99351
C  0.630893 -0.265177 0.429033
C  -0.841428 -0.435257 0.391733
C  2.588559 1.308879 0.622593
C  -1.614744 0.171952 -0.589581
C  -1.489065 -1.208332 1.34966
C  3.660101 0.781491 1.331525
C  2.882861 2.105795 -0.477879
C  -2.99317 0.037149 -0.624488
C  -2.864545 -1.361383 1.34149
C  -3.602978 -0.733785 0.350605
C  4.950719 1.069654 0.918951
C  5.125383 1.874041 -0.1966
C  1.81754 -3.264948 -0.716508
H  0.521463 1.844669 0.668502
H  1.052174 0.983288 2.082086
H  -0.908352 -1.695788 2.121808
H  3.488797 0.157696 2.200325
H  2.074466 2.541809 -1.057363
H  -3.574434 0.517133 -1.399397
H  -3.349807 -1.965623 2.095236
H  5.808728 0.678716 1.448766
H  6.122776 2.116398 -0.546301
H  2.42008 -3.548225 0.150038
H  2.479808 -2.92537 -1.516477
H  1.268071 -4.139143 -1.061913
elementType: Cl O N C H
totalener: -1645.86252602 hartree
nucrepener: 1588.25389537 hartree
electener: -3234.11642139 hartree
oneelecener: -5412.51720016 hartree
twoeener: 2178.40077876 hartree
cpcmener: -0.02105179 hartree
kineticenergy: 1641.45662209 hartree
xcener: -112.967759687125 hartree
chargesum: 0.0000000
charge: -0.070250 -0.081801 -0.227316 -0.127111 -0.365332 -0.067424 0.106165 0.012502 0.069579 0.015909 -0.121999 -0.166979 -0.027505 -0.166025 -0.175025 0.116072 -0.152381 0.008901 -0.118113 0.117583 0.118068 0.149241 0.143094 0.112127 0.128077 0.146599 0.155574 0.145411 0.101908 0.105897 0.114554
qa: -0.0703 -0.0818 -0.2273 -0.1271 -0.3653 -0.0674 0.1062 0.0125 0.0696 0.0159 -0.1220 -0.1670 -0.0275 -0.1660 -0.1750 0.1161 -0.1524 0.0089 -0.1181 0.1176 0.1181 0.1492 0.1431 0.1121 0.1281 0.1466 0.1556 0.1454 0.1019 0.1059 0.1146
va: 1.2581 1.2218 1.9337 2.8982 3.0708 3.8047 3.8732 3.6081 3.5484 3.9934 3.9469 3.9844 4.0815 4.0868 4.0083 3.8531 3.9016 3.9913 3.9039 1.0088 1.0067 1.0042 1.0076 1.0213 1.0201 1.0045 0.9918 0.9981 0.9941 0.9936 0.9940
dispcorr: -0.014762397 hartree
energy: -1645.877288417367
dipole: 24.54379 -24.65249 -0.10870 -5.24735 4.16356 -1.08379 6.98481 -5.28028 1.70453
magnitude: 2.02283 au
magnitude: 5.14163 debye
