program: Orca
programVersion: 4.2.1
elementType: Cl Cl O N N C C C C C C C C C C C C C C H H H H H H H H H H H H
charge: 0
multiplicity: 1
keywords: wb97x-d3
keywords: def2-TZVPP
keywords: def2/J RIJCOSX GRIDX6 NOFINALGRIDX
keywords: grid4 nofinalgrid
keywords: scfconv7
keywords: smallprint printgap noloewdin
keywords: NOSOSCF
formula: C14H12Cl2N2O
InChI: InChI=1S/C14H12Cl2N2O/c1-19-18-14(7-10-3-2-6-17-9-10)12-5-4-11(15)8-13(12)16/h2-6,8-9H,7H2,1H3
31 atoms
Cl -0.683529 0.445391 -2.311318
Cl -5.344182 -0.904099 -0.030361
O  0.863851 -2.235223 0.267202
N  1.421676 -1.001372 0.408912
N  4.618451 1.776996 1.656465
C  1.043115 1.353026 0.577663
C  0.569783 -0.06238 0.39935
C  -0.891858 -0.282238 0.280919
C  2.531135 1.510303 0.503868
C  -1.567433 -0.059474 -0.912128
C  -1.628582 -0.716264 1.377995
C  3.203605 1.497996 -0.712298
C  3.296882 1.653403 1.653452
C  -2.9365 -0.24171 -1.024313
C  -2.996509 -0.910009 1.296506
C  -3.63676 -0.668032 0.091415
C  4.581483 1.627775 -0.724265
C  5.244068 1.761186 0.4872
C  1.872814 -3.22615 0.3001
H  0.558042 1.983506 -0.172844
H  0.669138 1.713822 1.541518
H  -1.125096 -0.902496 2.317603
H  2.655802 1.388185 -1.640745
H  2.810769 1.668685 2.624397
H  -3.441321 -0.061959 -1.963297
H  -3.551178 -1.246597 2.161135
H  5.136663 1.625134 -1.652484
H  6.323361 1.862714 0.511264
H  2.581185 -3.114768 -0.524633
H  1.361916 -4.182428 0.19807
H  2.421197 -3.218495 1.245203
elementType: Cl O N C H
totalener: -1645.86319553 hartree
nucrepener: 1584.60942225 hartree
electener: -3230.47261777 hartree
oneelecener: -5405.07270043 hartree
twoeener: 2174.60008265 hartree
cpcmener: -0.02055990 hartree
kineticenergy: 1641.45620833 hartree
xcener: -112.967592745668 hartree
chargesum: -0.0000000
charge: -0.072303 -0.081993 -0.229778 -0.126721 -0.364428 -0.073268 0.097913 0.019540 0.075793 0.027889 -0.128263 -0.175018 -0.023021 -0.168592 -0.173026 0.116339 -0.152713 0.007653 -0.117557 0.124588 0.112609 0.149956 0.136080 0.121755 0.127870 0.146726 0.155718 0.144657 0.104585 0.113997 0.103014
qa: -0.0723 -0.0820 -0.2298 -0.1267 -0.3644 -0.0733 0.0979 0.0195 0.0758 0.0279 -0.1283 -0.1750 -0.0230 -0.1686 -0.1730 0.1163 -0.1527 0.0077 -0.1176 0.1246 0.1126 0.1500 0.1361 0.1218 0.1279 0.1467 0.1557 0.1447 0.1046 0.1140 0.1030
va: 1.2538 1.2213 1.9374 2.8797 3.0610 3.7909 3.8702 3.6189 3.5422 3.9766 3.9568 3.9923 4.0947 4.0900 4.0080 3.8513 3.9102 3.9945 3.9054 1.0099 1.0132 1.0034 1.0101 1.0129 1.0202 1.0044 0.9913 0.9987 0.9937 0.9940 0.9942
dispcorr: -0.014678201 hartree
energy: -1645.877873729205
dipole: 23.36061 -23.96730 -0.60670 -1.60494 1.37626 -0.22868 7.57308 -7.87034 -0.29726
magnitude: 0.71326 au
magnitude: 1.81295 debye
