program: Orca
programVersion: 4.2.1
elementType: Cl Cl O N N C C C C C C C C C C C C C C H H H H H H H H H H H H
charge: 0
multiplicity: 1
keywords: wb97x-d3
keywords: def2-TZVPP
keywords: def2/J RIJCOSX GRIDX6 NOFINALGRIDX
keywords: grid4 nofinalgrid
keywords: scfconv7
keywords: smallprint printgap noloewdin
keywords: NOSOSCF
formula: C14H12Cl2N2O
InChI: InChI=1S/C14H12Cl2N2O/c1-19-18-14(7-10-3-2-6-17-9-10)12-5-4-11(15)8-13(12)16/h2-6,8-9H,7H2,1H3
31 atoms
Cl -1.059242 -2.427342 1.577458
Cl -4.399235 1.120221 -0.65148
O  0.831803 -2.455253 -1.212296
N  1.674611 -1.884058 -0.312096
N  2.233344 3.58436 0.902484
C  2.023883 -0.159166 1.280572
C  1.171552 -0.877873 0.274786
C  -0.205031 -0.38419 0.032394
C  2.443865 1.197871 0.785276
C  -1.303242 -1.028206 0.592782
C  -0.438881 0.743173 -0.746943
C  3.361844 1.329172 -0.251092
C  1.91315 2.365348 1.31931
C  -2.596872 -0.576831 0.394824
C  -1.722656 1.217883 -0.96337
C  -2.789519 0.548767 -0.389259
C  3.705755 2.594563 -0.692764
C  3.112279 3.691204 -0.08435
C  1.414508 -3.629153 -1.743524
H  1.46861 -0.057713 2.21609
H  2.904322 -0.768758 1.489844
H  0.392523 1.258943 -1.207616
H  3.802099 0.44974 -0.706622
H  1.191243 2.30777 2.128272
H  -3.435354 -1.093462 0.840351
H  -1.881886 2.094184 -1.575501
H  4.419545 2.733846 -1.493055
H  3.360444 4.695514 -0.408371
H  2.35618 -3.420231 -2.257067
H  0.700472 -4.022899 -2.46502
H  1.587581 -4.383056 -0.971889
elementType: Cl O N C H
totalener: -1645.86367868 hartree
nucrepener: 1614.24024172 hartree
electener: -3260.10392040 hartree
oneelecener: -5464.25333514 hartree
twoeener: 2204.14941474 hartree
cpcmener: -0.01876165 hartree
kineticenergy: 1641.47036609 hartree
xcener: -112.969941339953 hartree
chargesum: 0.0000000
charge: -0.072322 -0.082587 -0.219840 -0.114822 -0.355067 0.013133 0.101133 0.026875 -0.047980 0.020944 -0.175259 -0.143312 -0.008562 -0.167627 -0.155040 0.107291 -0.146516 0.009408 -0.117906 0.101384 0.106319 0.155518 0.140264 0.126264 0.126130 0.145736 0.156782 0.146361 0.105508 0.114399 0.103391
qa: -0.0723 -0.0826 -0.2198 -0.1148 -0.3551 0.0131 0.1011 0.0269 -0.0480 0.0209 -0.1753 -0.1433 -0.0086 -0.1676 -0.1550 0.1073 -0.1465 0.0094 -0.1179 0.1014 0.1063 0.1555 0.1403 0.1263 0.1261 0.1457 0.1568 0.1464 0.1055 0.1144 0.1034
va: 1.2498 1.2205 1.9513 2.9316 3.0653 3.7907 3.8787 3.6164 3.6341 3.9487 3.9410 3.9553 4.0498 4.0979 4.0217 3.8588 3.9108 3.9982 3.8985 1.0148 1.0269 0.9936 1.0160 1.0128 1.0214 1.0054 0.9913 0.9982 0.9948 0.9939 0.9944
dispcorr: -0.015625489 hartree
energy: -1645.879304168817
dipole: 22.81252 -21.86888 0.94364 0.87994 -1.42525 -0.54532 -5.83124 5.06523 -0.76602
magnitude: 1.33215 au
magnitude: 3.38604 debye
