program: Orca
programVersion: 4.2.1
elementType: Cl Cl O N N C C C C C C C C C C C C C C H H H H H H H H H H H H
charge: 0
multiplicity: 1
keywords: wb97x-d3
keywords: def2-TZVPP
keywords: def2/J RIJCOSX GRIDX6 NOFINALGRIDX
keywords: grid4 nofinalgrid
keywords: scfconv7
keywords: smallprint printgap noloewdin
keywords: NOSOSCF
formula: C14H12Cl2N2O
InChI: InChI=1S/C14H12Cl2N2O/c1-19-18-14(7-10-3-2-6-17-9-10)12-5-4-11(15)8-13(12)16/h2-6,8-9H,7H2,1H3
31 atoms
Cl -0.984119 -1.758744 -2.370093
Cl -4.443097 0.905755 0.735378
O  0.803551 -2.759053 0.277584
N  1.671651 -1.896382 -0.312386
N  2.23809 3.60161 0.636478
C  2.069828 0.286415 -1.148065
C  1.1767 -0.747211 -0.52225
C  -0.216065 -0.363232 -0.188693
C  2.457006 1.347748 -0.154145
C  -1.281912 -0.766731 -0.986881
C  -0.49529 0.441719 0.910995
C  3.295477 1.053141 0.915769
C  1.960737 2.642494 -0.238585
C  -2.585034 -0.384625 -0.716716
C  -1.789345 0.838363 1.206861
C  -2.822011 0.420059 0.385752
C  3.594401 2.045064 1.832843
C  3.037094 3.302828 1.651583
C  1.399933 -4.036943 0.389481
H  2.962776 -0.210925 -1.531579
H  1.557588 0.741071 -1.9997
H  0.307919 0.759576 1.561577
H  3.704455 0.056109 1.031504
H  1.300195 2.913679 -1.056542
H  -3.396962 -0.707584 -1.353155
H  -1.982248 1.463307 2.067419
H  4.24398 1.851485 2.675566
H  3.249388 4.100276 2.354798
H  0.675352 -4.668047 0.901353
H  2.319622 -4.0058 0.978527
H  1.616913 -4.471418 -0.589284
elementType: Cl O N C H
totalener: -1645.86347290 hartree
nucrepener: 1615.01056517 hartree
electener: -3260.87403807 hartree
oneelecener: -5465.78227518 hartree
twoeener: 2204.90823712 hartree
cpcmener: -0.01867777 hartree
kineticenergy: 1641.46347700 hartree
xcener: -112.968854005056 hartree
chargesum: -0.0000000
charge: -0.071541 -0.082257 -0.220003 -0.114736 -0.354050 0.009413 0.099644 0.027667 -0.049853 0.018931 -0.172548 -0.144822 -0.009567 -0.164548 -0.156121 0.107883 -0.145803 0.008425 -0.118049 0.107016 0.102179 0.156883 0.140274 0.127396 0.126033 0.145496 0.156959 0.146253 0.114767 0.105067 0.103613
qa: -0.0715 -0.0823 -0.2200 -0.1147 -0.3540 0.0094 0.0996 0.0277 -0.0499 0.0189 -0.1725 -0.1448 -0.0096 -0.1645 -0.1561 0.1079 -0.1458 0.0084 -0.1180 0.1070 0.1022 0.1569 0.1403 0.1274 0.1260 0.1455 0.1570 0.1463 0.1148 0.1051 0.1036
va: 1.2506 1.2210 1.9524 2.9285 3.0649 3.7919 3.8780 3.6188 3.6411 3.9530 3.9401 3.9533 4.0500 4.0952 4.0242 3.8577 3.9109 3.9986 3.8989 1.0267 1.0141 0.9929 1.0167 1.0129 1.0214 1.0058 0.9911 0.9985 0.9938 0.9952 0.9940
dispcorr: -0.015662367 hartree
energy: -1645.879135266907
dipole: 22.57266 -21.67334 0.89932 -1.52220 0.73604 -0.78616 7.03965 -6.48761 0.55203
magnitude: 1.31589 au
magnitude: 3.34473 debye
