program: Orca
programVersion: 4.2.1
elementType: Cl Cl O N N C C C C C C C C C C C C C C H H H H H H H H H H H H
charge: 0
multiplicity: 1
keywords: wb97x-d3
keywords: def2-TZVPP
keywords: def2/J RIJCOSX GRIDX6 NOFINALGRIDX
keywords: grid4 nofinalgrid
keywords: scfconv7
keywords: smallprint printgap noloewdin
keywords: NOSOSCF
formula: C14H12Cl2N2O
InChI: InChI=1S/C14H12Cl2N2O/c1-19-18-14(7-10-3-2-6-17-9-10)12-5-4-11(15)8-13(12)16/h2-6,8-9H,7H2,1H3
31 atoms
Cl -0.558555 -1.403683 -2.67684
Cl -4.477803 0.988516 0.091513
O  0.585305 -2.874805 0.935405
N  1.56309 -2.145646 0.329425
N  3.609804 2.054826 1.804835
C  2.137885 -0.161756 -0.848443
C  1.136556 -1.070055 -0.190345
C  -0.2695 -0.607136 -0.11392
C  2.377078 1.055267 0.004748
C  -1.120108 -0.679293 -1.209976
C  -0.759636 -0.041003 1.058591
C  1.614325 2.210038 -0.116226
C  3.359441 1.039801 0.990151
C  -2.417162 -0.193964 -1.164082
C  -2.050264 0.452301 1.134956
C  -2.865772 0.372039 0.017253
C  1.863574 3.276919 0.732907
C  2.871036 3.150781 1.675679
C  1.147965 -4.009491 1.565369
H  3.06931 -0.708496 -0.999687
H  1.773976 0.139628 -1.83317
H  -0.117904 0.024308 1.927241
H  0.837525 2.281111 -0.868202
H  3.976751 0.155605 1.119022
H  -3.061726 -0.260461 -2.029606
H  -2.411176 0.892694 2.053831
H  1.290274 4.191451 0.665244
H  3.093992 3.9682 2.352222
H  0.319171 -4.536623 2.035153
H  1.869742 -3.730547 2.336873
H  1.630892 -4.678133 0.848713
elementType: Cl O N C H
totalener: -1645.86337623 hartree
nucrepener: 1617.06864190 hartree
electener: -3262.93201813 hartree
oneelecener: -5469.69344761 hartree
twoeener: 2206.76142948 hartree
cpcmener: -0.01901242 hartree
kineticenergy: 1641.45753148 hartree
xcener: -112.967291857169 hartree
chargesum: -0.0000000
charge: -0.068718 -0.081052 -0.224996 -0.111144 -0.359055 -0.033709 0.090913 -0.038794 0.020062 0.058886 -0.141667 -0.163386 -0.017776 -0.167377 -0.159065 0.116148 -0.144452 0.007889 -0.114937 0.100710 0.111672 0.148286 0.146471 0.123354 0.127202 0.148188 0.156791 0.146322 0.114149 0.103795 0.105292
qa: -0.0687 -0.0811 -0.2250 -0.1111 -0.3591 -0.0337 0.0909 -0.0388 0.0201 0.0589 -0.1417 -0.1634 -0.0178 -0.1674 -0.1591 0.1161 -0.1445 0.0079 -0.1149 0.1007 0.1117 0.1483 0.1465 0.1234 0.1272 0.1482 0.1568 0.1463 0.1141 0.1038 0.1053
va: 1.2583 1.2225 1.9447 2.9446 3.0658 3.8220 3.8972 3.5924 3.5494 3.9306 3.9273 3.9539 4.0755 4.1019 4.0132 3.8540 3.9033 3.9960 3.8959 1.0343 1.0180 1.0020 0.9987 1.0182 1.0208 1.0032 0.9909 0.9981 0.9939 0.9941 0.9943
dispcorr: -0.015770120 hartree
energy: -1645.879146352248
dipole: 18.30865 -18.90040 -0.59176 -1.41267 1.69441 0.28174 10.53534 -10.71069 -0.17535
magnitude: 0.67846 au
magnitude: 1.72450 debye
