program: Orca
programVersion: 4.2.1
elementType: Cl Cl O N N C C C C C C C C C C C C C C H H H H H H H H H H H H
charge: 0
multiplicity: 1
keywords: wb97x-d3
keywords: def2-TZVPP
keywords: def2/J RIJCOSX GRIDX6 NOFINALGRIDX
keywords: grid4 nofinalgrid
keywords: scfconv7
keywords: smallprint printgap noloewdin
keywords: NOSOSCF
formula: C14H12Cl2N2O
InChI: InChI=1S/C14H12Cl2N2O/c1-19-18-14(7-10-3-2-6-17-9-10)12-5-4-11(15)8-13(12)16/h2-6,8-9H,7H2,1H3
31 atoms
Cl -1.005331 -1.368693 2.507173
Cl -4.197539 1.181856 -0.962862
O  0.669262 -3.027304 -0.79045
N  1.572321 -2.328706 -0.049815
N  1.750728 3.243206 0.039636
C  2.052114 -0.337115 1.159827
C  1.130999 -1.210106 0.354553
C  -0.210418 -0.672538 0.02239
C  2.332033 0.948108 0.430008
C  -1.244723 -0.656855 0.949014
C  -0.445657 -0.11086 -1.228647
C  3.305216 1.024858 -0.558635
C  1.585081 2.093992 0.680341
C  -2.476826 -0.090441 0.66254
C  -1.665402 0.460389 -1.544983
C  -2.669783 0.466067 -0.590181
C  3.492748 2.221414 -1.230747
C  2.689188 3.300883 -0.896568
C  1.250835 -4.231078 -1.253947
H  1.596792 -0.119643 2.129414
H  2.977615 -0.881285 1.352928
H  0.34378 -0.10839 -1.968496
H  3.910999 0.159147 -0.799542
H  0.815831 2.079251 1.446886
H  -3.267015 -0.088111 1.400505
H  -1.825251 0.896578 -2.520919
H  4.244656 2.318712 -2.001911
H  2.808042 4.249854 -1.407463
H  1.547985 -4.884569 -0.429789
H  2.116997 -4.045391 -1.89381
H  0.482233 -4.731664 -1.840325
elementType: Cl O N C H
totalener: -1645.86357843 hartree
nucrepener: 1625.97803208 hartree
electener: -3271.84161051 hartree
oneelecener: -5487.84785426 hartree
twoeener: 2216.00624375 hartree
cpcmener: -0.01920707 hartree
kineticenergy: 1641.46043316 hartree
xcener: -112.967901098282 hartree
chargesum: -0.0000000
charge: -0.069133 -0.081443 -0.223449 -0.107748 -0.351926 -0.043116 0.089014 -0.040297 0.031037 0.046224 -0.128162 -0.162578 -0.023259 -0.158128 -0.166312 0.117840 -0.139873 0.005334 -0.116030 0.112583 0.100326 0.143294 0.144949 0.120394 0.126205 0.147203 0.157075 0.145946 0.105693 0.103637 0.114699
qa: -0.0691 -0.0814 -0.2234 -0.1077 -0.3519 -0.0431 0.0890 -0.0403 0.0310 0.0462 -0.1282 -0.1626 -0.0233 -0.1581 -0.1663 0.1178 -0.1399 0.0053 -0.1160 0.1126 0.1003 0.1433 0.1449 0.1204 0.1262 0.1472 0.1571 0.1459 0.1057 0.1036 0.1147
va: 1.2572 1.2218 1.9445 2.9523 3.0667 3.8230 3.8892 3.6080 3.5334 3.9393 3.9317 3.9703 4.0624 4.0972 4.0259 3.8563 3.8933 3.9994 3.8948 1.0171 1.0352 1.0062 1.0089 1.0116 1.0209 1.0037 0.9904 0.9980 0.9942 0.9942 0.9941
dispcorr: -0.016022489 hartree
energy: -1645.879600923288
dipole: 21.84042 -20.73658 1.10383 -4.36559 3.56957 -0.79603 -8.17831 7.30655 -0.87176
magnitude: 1.61619 au
magnitude: 4.10802 debye
