program: Gaussian 09
title: 000034375
version: EM64L-G09RevD.01
frameworkgroup: C1[X(C14H25NO)]
method: RPBEPBE
basis: SDD
operation: Freq
keyword: #p
keyword: freq=noraman
keyword: PBEPBE/SDD
title: #p freq=noraman PBEPBE/SDD
converged: YES YES NO NO
title: Mulliken charges:
elementType: O N C C C C C C C C C C C C C C H H H H H H H H H H H H H H H H H H H H H H H H H
charge: -0.184069 -0.277928 0.340770 0.263038 -0.221384 -0.191786 -0.546688 -0.496945 0.004658 -0.782688 -0.791281 -0.815796 -0.472411 -0.320466 -0.379975 -0.679978 0.263547 0.252500 0.240693 0.240877 0.228327 0.226684 0.215871 0.235162 0.217846 0.215369 0.217481 0.234793 0.239985 0.210455 0.225074 0.225830 0.209366 0.235808 0.201945 0.174275 0.184988 0.218402 0.209616 0.209166 0.218869
chargesum: 0.00000
title: Mulliken charges with hydrogens summed into heavy atoms:
elementType: O N C C C C C C C C C C C C C C
charge: -0.184069 -0.042120 0.340770 0.263038 0.042163 0.060714 -0.065118 -0.041934 0.004658 -0.113809 -0.123639 -0.140282 -0.037215 0.055754 0.023415 -0.042326
polarizability: 1.85042879e+02 4.52993014e-02 1.45849408e+02 -3.40360863e-01 2.04740985e-01 1.35482654e+02
1716.lowfreq: -14.8817 -9.1272 -0.0001 0.0003 0.0007 7.8790 25.6841 30.9461 48.1890
frequency: 22.4905 29.6984 48.1275 82.5474 110.1548 123.4495 129.9314 150.2646 165.2887 179.6037 199.4090 210.0319 216.4562 230.6396 235.6637 263.4163 289.1065 334.0984 349.1920 390.6884 396.2986 442.4381 465.0591 486.4356 533.3311 560.8943 574.1813 621.1644 668.1601 700.7038 726.9577 754.5890 780.1752 827.8814 843.4848 855.9331 881.7788 894.4863 898.8369 932.6460 936.3307 940.8919 976.9476 980.0465 1001.8152 1012.6217 1034.3272 1050.3188 1065.7634 1083.5285 1095.9899 1109.0553 1120.8374 1130.1712 1144.7561 1152.1819 1163.4091 1180.7942 1199.1174 1208.0393 1214.7171 1215.4547 1236.6951 1251.1405 1264.5246 1278.5484 1280.2860 1297.4927 1303.6234 1314.3466 1316.5012 1342.3812 1380.2778 1382.4694 1389.9870 1391.2666 1400.3119 1450.7423 1459.0223 1464.1152 1469.3795 1471.4677 1475.2755 1476.9750 1479.6723 1481.4869 1485.6665 1489.5894 1493.6868 1497.8410 1518.1575 1650.6722 2848.0934 2884.9151 2961.2534 2966.7158 2973.9517 2974.7186 2978.4260 2981.0447 2991.6678 2999.7421 3008.2741 3028.1694 3034.0754 3053.5560 3056.4959 3061.9257 3071.2950 3072.5195 3073.8448 3075.2615 3076.0573 3076.6028 3083.8747 3093.7948 3408.5050
redmass: 2.7696 2.0918 2.8721 3.4058 3.0850 1.3526 2.1060 1.5875 1.4189 1.6570 1.6599 2.9770 1.1591 2.9158 2.1076 2.4798 2.9235 2.8103 2.2954 2.7365 2.4954 3.5395 3.3019 3.3542 3.9048 3.9524 2.9106 3.7353 1.4934 2.9064 2.6415 1.0801 2.2067 2.0867 2.1292 2.0807 1.2256 2.3558 1.7341 1.9818 1.8163 1.4010 2.0100 1.5605 1.4881 3.1400 2.0529 1.7730 2.5603 1.4223 1.7038 2.2080 1.4592 1.9660 3.9176 2.3152 2.4532 1.6501 1.7395 1.8148 1.6373 1.6150 1.6256 1.3449 2.0774 1.2496 1.6059 1.3094 1.5128 1.5504 2.2284 1.4187 1.2200 1.3547 1.2907 1.2353 1.1922 1.2096 1.0552 1.0500 1.0554 1.0614 1.0540 1.0431 1.0596 1.0675 1.0710 1.0748 1.0736 1.0754 1.0789 11.7137 1.0711 1.0712 1.0780 1.0652 1.0383 1.0365 1.0373 1.0366 1.0836 1.0600 1.0878 1.0635 1.0983 1.1035 1.0990 1.0979 1.1008 1.0990 1.0966 1.0914 1.0991 1.0984 1.1022 1.0964 1.0739
irintensity: 0.8483 0.3851 0.4302 2.7176 2.8410 0.2102 2.5826 0.6256 0.8782 0.4450 0.1368 0.1145 0.1485 2.2319 0.5551 1.7053 2.5141 1.6442 0.6973 0.6068 0.2585 0.2556 0.7638 0.8743 4.3953 3.7034 5.8539 8.8657 66.4434 5.2217 5.4280 7.9353 8.0947 0.8243 9.1430 0.2237 3.8220 0.2985 1.6133 6.3893 4.9611 1.8868 19.3350 3.8096 17.2789 8.8997 23.7510 8.4344 3.4994 3.5876 4.0531 9.1014 18.2768 2.7817 56.4222 5.2768 11.4110 2.9575 6.4625 7.5986 1.7957 5.8078 4.0252 2.8736 13.8895 1.5335 4.0985 6.4271 4.0268 5.2951 8.1688 23.2111 15.5956 7.7704 6.8728 17.8326 22.3127 31.9411 6.4083 6.5602 1.0576 8.2617 8.0218 13.0488 10.7697 2.4926 4.0583 15.9718 12.8237 3.7337 14.9328 164.6441 111.8844 65.5216 4.5889 26.2106 27.9394 37.0947 25.5416 46.9176 35.9823 37.4830 35.2980 38.6671 14.8733 4.8981 0.9728 51.0113 73.8291 18.5038 28.2039 33.5686 52.8229 18.8702 69.7180 27.3835 2.3029
temp: 298.150 k
press: 1.00000 atm
elementType: 8 7 6 6 6 6 6 6 6 6 6 6 6 6 6 6 1 1 1 1 1 1 1 1 1 1 1 1 1 1 1 1 1 1 1 1 1 1 1 1 1
symmnumber: 1
zpe: 954926.2 jmol-1
zpe.correction: 0.363712 hartree
zpe.thermalcorrener: 0.382033 hartree
zpe.thermalcorrenthalpy: 0.382977 hartree
zpe.thermalcorrgfe: 0.316924 hartree
zpe.sumelectzpe: -677.162009 hartree
zpe.sumelectthermal: -677.143689 hartree
zpe.sumelectthermalent: -677.142744 hartree
zpe.sumelectthermalfe: -677.208797 hartree
dipole: -0.5945 -2.6224 -0.0371
dipole: 2.6892
quadrupole: -94.2617 -110.9056 -96.1250
quadrupole: -6.1516 2.4997 2.3860
quadrupole: 6.1691 -10.4749 4.3058 -6.1516 2.4997 2.3860
hfenergy: -677.5257212 hartree
pointgroup: C01 [X(C14H25N1O1)]
dipole: -0.2387994 1.029232 0.0554821 debye
polarizability: 185.0419409|0.1253543|145.8169665|0.3785659|0.6184861|135.5160332 unknown
InChI: InChI=1S/C14H25NO/c1-5-8-15-9-10-11-6-7-14(4,12(10)16)13(11,2)3/h10-11,15H,5-9H2,1-4H3
charge 0 multiplicity 1
41 atoms
O  1.223743 -2.546968 0.297623
N  -2.43847 0.020248 0.365078
C  2.071606 0.935143 0.474043
C  2.33497 -0.396139 -0.343545
C  0.54859 1.013484 0.060677
C  0.008852 -0.372448 0.534795
C  1.793777 -0.004019 -1.778763
C  0.62628 1.004765 -1.493071
C  1.203951 -1.295635 0.194617
C  2.323255 0.779124 1.996864
C  2.911577 2.141667 -0.006598
C  3.723829 -1.026077 -0.32375
C  -1.334799 -0.885332 -0.019618
C  -3.769473 -0.37223 -0.149214
C  -4.857144 0.621323 0.304467
C  -6.259488 0.242223 -0.217647
H  -0.009698 1.866005 0.478261
H  -0.086988 -0.355727 1.641749
H  1.463859 -0.897154 -2.339341
H  2.612878 0.457946 -2.359547
H  0.858242 2.012084 -1.879862
H  -0.327869 0.700505 -1.953063
H  3.409327 0.742122 2.202271
H  1.883397 -0.1357 2.430653
H  1.912731 1.647361 2.546498
H  3.978922 1.992667 0.242313
H  2.577646 3.063583 0.507037
H  2.84555 2.322179 -1.091901
H  3.714098 -2.000798 -0.843823
H  4.46574 -0.374219 -0.820617
H  4.064112 -1.21459 0.710694
H  -1.47286 -1.935027 0.338079
H  -1.307716 -0.938659 -1.125227
H  -2.463597 0.162517 1.386282
H  -3.718597 -0.379619 -1.256921
H  -4.065096 -1.407768 0.161381
H  -4.874733 0.660941 1.414031
H  -4.576395 1.633585 -0.043336
H  -6.279673 0.223318 -1.323621
H  -6.562881 -0.759446 0.141134
H  -7.021656 0.967365 0.120514
