program: Orca
programVersion: 4.2.1
elementType: Cl Cl O N N C C C C C C C C C C C C C C H H H H H H H H H H H H
charge: 0
multiplicity: 1
keywords: wb97x-d3
keywords: def2-TZVPP
keywords: def2/J RIJCOSX GRIDX6 NOFINALGRIDX
keywords: grid4 nofinalgrid
keywords: scfconv7
keywords: smallprint printgap noloewdin
keywords: NOSOSCF
formula: C14H12Cl2N2O
InChI: InChI=1S/C14H12Cl2N2O/c1-19-18-14(7-10-3-2-6-17-9-10)12-5-4-11(15)8-13(12)16/h2-6,8-9H,7H2,1H3
31 atoms
Cl -0.63471 0.409354 -2.293624
Cl -5.352559 -0.827711 -0.072835
O  0.880713 -2.25926 0.293402
N  1.425742 -1.026254 0.448199
N  4.62659 1.82642 1.634075
C  1.041121 1.324734 0.621081
C  0.569311 -0.092568 0.436846
C  -0.891265 -0.304124 0.297447
C  2.526788 1.493207 0.524336
C  -1.545336 -0.074053 -0.906092
C  -1.654301 -0.717253 1.383415
C  3.178108 1.459755 -0.701891
C  3.310828 1.677867 1.655259
C  -2.915877 -0.229953 -1.034989
C  -3.024474 -0.880015 1.284712
C  -3.645346 -0.632199 0.070699
C  4.551657 1.614764 -0.740455
C  5.230143 1.794265 0.457051
C  1.904193 -3.230037 0.281901
H  0.540859 1.955377 -0.119962
H  0.679957 1.682137 1.591863
H  -1.162473 -0.914248 2.326831
H  2.611424 1.310427 -1.613257
H  2.84296 1.708784 2.635269
H  -3.403122 -0.045541 -1.981649
H  -3.603634 -1.199143 2.139264
H  5.091132 1.597112 -1.677576
H  6.3076 1.917117 0.464473
H  2.600265 -3.075587 -0.545836
H  1.407677 -4.190636 0.155613
H  2.467907 -3.238314 1.217916
totalener: -1645.84451457 hartree
nucrepener: 1585.68160673 hartree
electener: -3231.52612130 hartree
oneelecener: -5406.74025253 hartree
twoeener: 2175.21413124 hartree
kineticenergy: 1641.48704877 hartree
xcener: -112.971677274899 hartree
chargesum: -0.0000000
charge: -0.065422 -0.066135 -0.201870 -0.087694 -0.292381 -0.124414 0.069653 0.028254 0.110158 0.036080 -0.096913 -0.153645 -0.022366 -0.177653 -0.162150 0.110377 -0.119879 0.007681 -0.120488 0.119204 0.099483 0.125424 0.113049 0.088810 0.117620 0.124958 0.121441 0.116139 0.100120 0.103712 0.098846
qa: -0.0654 -0.0661 -0.2019 -0.0877 -0.2924 -0.1244 0.0697 0.0283 0.1102 0.0361 -0.0969 -0.1536 -0.0224 -0.1777 -0.1622 0.1104 -0.1199 0.0077 -0.1205 0.1192 0.0995 0.1254 0.1130 0.0888 0.1176 0.1250 0.1214 0.1161 0.1001 0.1037 0.0988
va: 1.2611 1.2386 1.9650 2.8882 3.1049 3.8230 3.8536 3.6557 3.5321 3.9847 3.9681 4.0254 4.1261 4.1020 4.0345 3.9177 3.9085 4.0249 3.9284 1.0106 1.0140 1.0105 1.0161 1.0133 1.0233 1.0123 1.0010 1.0011 0.9958 0.9946 0.9955
dispcorr: -0.014708868 hartree
energy: -1645.859223439259
dipole: 23.25131 -23.67521 -0.42390 -1.69535 1.32750 -0.36785 7.55399 -7.80675 -0.25276
magnitude: 0.61554 au
magnitude: 1.56458 debye
