program: Orca
programVersion: 4.2.1
elementType: Cl Cl O N N C C C C C C C C C C C C C C H H H H H H H H H H H H
charge: 0
multiplicity: 1
keywords: wb97x-d3
keywords: def2-TZVPP
keywords: def2/J RIJCOSX GRIDX6 NOFINALGRIDX
keywords: grid4 nofinalgrid
keywords: scfconv7
keywords: smallprint printgap noloewdin
keywords: NOSOSCF
formula: C14H12Cl2N2O
InChI: InChI=1S/C14H12Cl2N2O/c1-19-18-14(7-10-3-2-6-17-9-10)12-5-4-11(15)8-13(12)16/h2-6,8-9H,7H2,1H3
31 atoms
Cl -0.981503 -1.439944 -2.49883
Cl -4.361805 0.896035 0.94151
O  0.8371 -2.745381 0.199978
N  1.701257 -1.878414 -0.385632
N  2.180403 3.647966 0.573622
C  2.078362 0.320097 -1.193071
C  1.205275 -0.724206 -0.558687
C  -0.173561 -0.338937 -0.173417
C  2.448686 1.39648 -0.209092
C  -1.251821 -0.619132 -1.004575
C  -0.42427 0.337186 1.014849
C  3.315672 1.132578 0.845163
C  1.913959 2.676993 -0.287242
C  -2.543343 -0.244589 -0.675039
C  -1.706061 0.723337 1.368661
C  -2.757349 0.425698 0.517895
C  3.605265 2.138808 1.749317
C  3.00995 3.380177 1.569006
C  1.410104 -4.031599 0.252089
H  2.97538 -0.166205 -1.580096
H  1.551041 0.758172 -2.04485
H  0.399057 0.565413 1.678262
H  3.751178 0.146033 0.954715
H  1.226383 2.925185 -1.090581
H  -3.366841 -0.473295 -1.336113
H  -1.883946 1.249239 2.295645
H  4.278384 1.969909 2.578771
H  3.211094 4.191098 2.260448
H  0.672772 -4.670165 0.73454
H  2.331928 -4.044763 0.838689
H  1.620939 -4.423634 -0.745548
totalener: -1645.84616623 hartree
nucrepener: 1616.68401201 hartree
electener: -3262.53017823 hartree
oneelecener: -5468.73751160 hartree
twoeener: 2206.20733336 hartree
kineticenergy: 1641.49328896 hartree
xcener: -112.972543336332 hartree
chargesum: -0.0000000
charge: -0.061078 -0.068505 -0.193403 -0.085669 -0.280745 -0.030173 0.085873 0.018984 -0.020589 0.042098 -0.137806 -0.158651 -0.011222 -0.181720 -0.143074 0.106221 -0.111878 0.005673 -0.122005 0.104625 0.096132 0.128821 0.127541 0.101423 0.115278 0.124245 0.126492 0.120371 0.105752 0.096483 0.100506
qa: -0.0611 -0.0685 -0.1934 -0.0857 -0.2807 -0.0302 0.0859 0.0190 -0.0206 0.0421 -0.1378 -0.1587 -0.0112 -0.1817 -0.1431 0.1062 -0.1119 0.0057 -0.1220 0.1046 0.0961 0.1288 0.1275 0.1014 0.1153 0.1242 0.1265 0.1204 0.1058 0.0965 0.1005
va: 1.2627 1.2358 1.9703 2.9357 3.1019 3.8120 3.8711 3.6647 3.5987 3.9598 3.9609 3.9790 4.0762 4.1174 4.0466 3.9153 3.8899 4.0242 3.9240 1.0279 1.0168 1.0020 1.0201 1.0132 1.0251 1.0126 1.0005 1.0006 0.9955 0.9958 0.9954
dispcorr: -0.015727260 hartree
energy: -1645.861893487646
dipole: 22.44367 -21.75123 0.69243 -2.27462 1.58711 -0.68751 6.53705 -6.12137 0.41569
magnitude: 1.06063 au
magnitude: 2.69590 debye
