program: Orca
programVersion: 4.2.1
elementType: Cl Cl O N N C C C C C C C C C C C C C C H H H H H H H H H H H H
charge: 0
multiplicity: 1
keywords: wb97x-d3
keywords: def2-TZVPP
keywords: def2/J RIJCOSX GRIDX6 NOFINALGRIDX
keywords: grid4 nofinalgrid
keywords: scfconv7
keywords: smallprint printgap noloewdin
keywords: NOSOSCF
formula: C14H12Cl2N2O
InChI: InChI=1S/C14H12Cl2N2O/c1-19-18-14(7-10-3-2-6-17-9-10)12-5-4-11(15)8-13(12)16/h2-6,8-9H,7H2,1H3
31 atoms
Cl -0.94162 -1.53159 -2.495314
Cl -4.386062 0.935011 0.786776
O  0.798369 -2.776849 0.282654
N  1.684969 -1.931634 -0.301164
N  2.167793 3.601037 0.568313
C  2.101105 0.245403 -1.14813
C  1.201924 -0.779322 -0.518176
C  -0.183832 -0.374891 -0.180296
C  2.448007 1.336604 -0.171623
C  -1.242514 -0.66748 -1.032124
C  -0.459092 0.334752 0.982846
C  3.275448 1.082801 0.916318
C  1.925097 2.619097 -0.287462
C  -2.538198 -0.270455 -0.747464
C  -1.745407 0.743125 1.291816
C  -2.776596 0.43424 0.420723
C  3.538994 2.099858 1.81617
C  2.958234 3.342096 1.597376
C  1.367609 -4.05984 0.406528
H  3.006121 -0.254179 -1.497785
H  1.603588 0.670959 -2.023811
H  0.348393 0.572199 1.662309
H  3.698323 0.094611 1.056189
H  1.268701 2.860244 -1.118483
H  -3.346144 -0.508368 -1.424352
H  -1.941903 1.295203 2.199624
H  4.179829 1.938556 2.67225
H  3.140428 4.161804 2.283667
H  0.62024 -4.673607 0.905623
H  2.278251 -4.045396 1.010352
H  1.596346 -4.499823 -0.567067
totalener: -1645.84613154 hartree
nucrepener: 1617.48194903 hartree
electener: -3263.32808057 hartree
oneelecener: -5470.33432640 hartree
twoeener: 2207.00624583 hartree
kineticenergy: 1641.49251326 hartree
xcener: -112.972521718127 hartree
chargesum: 0.0000000
charge: -0.060752 -0.068483 -0.192880 -0.086141 -0.280209 -0.030425 0.085673 0.019432 -0.019832 0.042440 -0.137444 -0.158867 -0.012062 -0.181656 -0.142873 0.106183 -0.112249 0.005275 -0.122150 0.104910 0.095902 0.128428 0.127394 0.101744 0.115190 0.124064 0.126457 0.120436 0.105568 0.096107 0.100818
qa: -0.0608 -0.0685 -0.1929 -0.0861 -0.2802 -0.0304 0.0857 0.0194 -0.0198 0.0424 -0.1374 -0.1589 -0.0121 -0.1817 -0.1429 0.1062 -0.1122 0.0053 -0.1221 0.1049 0.0959 0.1284 0.1274 0.1017 0.1152 0.1241 0.1265 0.1204 0.1056 0.0961 0.1008
va: 1.2632 1.2358 1.9705 2.9355 3.1019 3.8126 3.8706 3.6646 3.5993 3.9600 3.9602 3.9792 4.0763 4.1172 4.0468 3.9151 3.8909 4.0244 3.9243 1.0279 1.0169 1.0021 1.0204 1.0132 1.0251 1.0126 1.0006 1.0006 0.9955 0.9962 0.9949
dispcorr: -0.015757634 hartree
energy: -1645.861889173011
dipole: 22.24023 -21.56006 0.68017 -2.30158 1.62133 -0.68025 7.33990 -6.88250 0.45740
magnitude: 1.06517 au
magnitude: 2.70745 debye
