program: Orca
programVersion: 4.2.1
elementType: Cl Cl O N N C C C C C C C C C C C C C C H H H H H H H H H H H H
charge: 0
multiplicity: 1
keywords: wb97x-d3
keywords: def2-TZVPP
keywords: def2/J RIJCOSX GRIDX6 NOFINALGRIDX
keywords: grid4 nofinalgrid
keywords: scfconv7
keywords: smallprint printgap noloewdin
keywords: NOSOSCF
formula: C14H12Cl2N2O
InChI: InChI=1S/C14H12Cl2N2O/c1-19-18-14(7-10-3-2-6-17-9-10)12-5-4-11(15)8-13(12)16/h2-6,8-9H,7H2,1H3
31 atoms
Cl -0.648328 -1.397343 -2.690199
Cl -4.436295 0.944269 0.293416
O  0.548919 -3.065261 0.700953
N  1.536054 -2.315398 0.147125
N  1.91398 3.271286 0.44454
C  2.149675 -0.254435 -0.86047
C  1.134237 -1.182733 -0.258042
C  -0.256142 -0.686887 -0.118373
C  2.348888 0.951517 0.016804
C  -1.147896 -0.719409 -1.182173
C  -0.692625 -0.138742 1.082393
C  3.043751 0.859399 1.216705
C  1.805589 2.188639 -0.310261
C  -2.436282 -0.222222 -1.07005
C  -1.972422 0.3674 1.221776
C  -2.836242 0.319488 0.139442
C  3.166571 1.983646 2.01405
C  2.581411 3.166164 1.582384
C  1.060213 -4.320347 1.087648
H  3.087041 -0.797797 -0.989217
H  1.8146 0.057569 -1.853024
H  -0.0117 -0.100051 1.922045
H  3.477895 -0.086344 1.520407
H  1.250398 2.304385 -1.236708
H  -3.11416 -0.259956 -1.910626
H  -2.294794 0.794618 2.160492
H  3.704345 1.949796 2.95175
H  2.655185 4.066261 2.182756
H  1.850105 -4.226491 1.837045
H  1.448118 -4.8824 0.234947
H  0.223564 -4.865443 1.52046
totalener: -1645.84639146 hartree
nucrepener: 1621.25772080 hartree
electener: -3267.10411226 hartree
oneelecener: -5477.88768572 hartree
twoeener: 2210.78357346 hartree
kineticenergy: 1641.49192168 hartree
xcener: -112.971995733266 hartree
chargesum: -0.0000000
charge: -0.061014 -0.067778 -0.194392 -0.086169 -0.280871 -0.055249 0.086887 -0.020898 0.022950 0.052596 -0.105373 -0.174034 -0.017322 -0.175697 -0.144041 0.110975 -0.109182 0.005981 -0.120413 0.101977 0.098953 0.117498 0.128340 0.100332 0.115712 0.123882 0.126249 0.119630 0.094296 0.101012 0.105162
qa: -0.0610 -0.0678 -0.1944 -0.0862 -0.2809 -0.0552 0.0869 -0.0209 0.0230 0.0526 -0.1054 -0.1740 -0.0173 -0.1757 -0.1440 0.1110 -0.1092 0.0060 -0.1204 0.1020 0.0990 0.1175 0.1283 0.1003 0.1157 0.1239 0.1262 0.1196 0.0943 0.1010 0.1052
va: 1.2662 1.2368 1.9674 2.9478 3.1044 3.8237 3.8701 3.6712 3.5596 3.9589 3.9547 3.9898 4.0777 4.1121 4.0431 3.9195 3.8853 4.0271 3.9245 1.0322 1.0207 1.0122 1.0171 1.0118 1.0245 1.0117 1.0003 1.0003 0.9956 0.9955 0.9955
dispcorr: -0.015822081 hartree
energy: -1645.862213541886
dipole: 20.46401 -19.88160 0.58241 -4.22866 3.50175 -0.72691 11.12149 -10.42761 0.69388
magnitude: 1.16150 au
magnitude: 2.95230 debye
