program: Orca
programVersion: 4.2.1
elementType: Cl Cl O N N C C C C C C C C C C C C C C H H H H H H H H H H H H
charge: 0
multiplicity: 1
keywords: wb97x-d3
keywords: def2-TZVPP
keywords: def2/J RIJCOSX GRIDX6 NOFINALGRIDX
keywords: grid4 nofinalgrid
keywords: scfconv7
keywords: smallprint printgap noloewdin
keywords: NOSOSCF
formula: C14H12Cl2N2O
InChI: InChI=1S/C14H12Cl2N2O/c1-19-18-14(7-10-3-2-6-17-9-10)12-5-4-11(15)8-13(12)16/h2-6,8-9H,7H2,1H3
31 atoms
Cl -0.765422 -1.360549 -2.633951
Cl -4.404663 0.96864 0.53841
O  0.656481 -2.985632 0.671947
N  1.595329 -2.219662 0.058078
N  1.93229 3.307761 0.520278
C  2.112159 -0.144745 -0.976394
C  1.150983 -1.093255 -0.318061
C  -0.235892 -0.61878 -0.096589
C  2.388807 1.03033 -0.077783
C  -1.187488 -0.67437 -1.106017
C  -0.608534 -0.063173 1.121727
C  3.248234 0.916786 1.007691
C  1.758825 2.255433 -0.264635
C  -2.4733 -0.191627 -0.925028
C  -1.885002 0.428462 1.329771
C  -2.80912 0.358817 0.299835
C  3.44236 2.010398 1.833252
C  2.758331 3.183278 1.546523
C  1.204222 -4.240789 1.003599
H  3.034622 -0.680394 -1.203415
H  1.692004 0.200015 -1.924535
H  0.119574 -0.008271 1.9197
H  3.754862 -0.021329 1.201635
H  1.072617 2.386489 -1.096135
H  -3.198034 -0.246737 -1.724346
H  -2.158145 0.862436 2.280783
H  4.109313 1.960079 2.682881
H  2.885237 4.059913 2.172105
H  0.404931 -4.799448 1.486851
H  2.044712 -4.150432 1.696322
H  1.534651 -4.787802 0.117721
totalener: -1645.84629812 hartree
nucrepener: 1620.07979932 hartree
electener: -3265.92609744 hartree
oneelecener: -5475.53753822 hartree
twoeener: 2209.61144079 hartree
kineticenergy: 1641.49796170 hartree
xcener: -112.973071681050 hartree
chargesum: -0.0000000
charge: -0.060825 -0.067596 -0.194689 -0.087013 -0.280434 -0.057194 0.088614 -0.018893 0.017282 0.051984 -0.106956 -0.161347 -0.022181 -0.178803 -0.142019 0.111646 -0.110114 0.004696 -0.120492 0.101002 0.101830 0.118495 0.126205 0.101570 0.115527 0.124378 0.125569 0.119338 0.104918 0.094612 0.100889
qa: -0.0608 -0.0676 -0.1947 -0.0870 -0.2804 -0.0572 0.0886 -0.0189 0.0173 0.0520 -0.1070 -0.1613 -0.0222 -0.1788 -0.1420 0.1116 -0.1101 0.0047 -0.1205 0.1010 0.1018 0.1185 0.1262 0.1016 0.1155 0.1244 0.1256 0.1193 0.1049 0.0946 0.1009
va: 1.2664 1.2368 1.9670 2.9473 3.1023 3.8256 3.8735 3.6638 3.5539 3.9565 3.9521 3.9903 4.0784 4.1146 4.0390 3.9175 3.8876 4.0264 3.9247 1.0326 1.0204 1.0110 1.0179 1.0114 1.0247 1.0114 1.0004 1.0005 0.9956 0.9955 0.9954
dispcorr: -0.015805092 hartree
energy: -1645.862103210924
dipole: 21.36252 -20.69861 0.66391 -4.01333 3.29560 -0.71773 9.82471 -9.23796 0.58675
magnitude: 1.14026 au
magnitude: 2.89831 debye
