program: Orca
programVersion: 4.2.1
elementType: Cl Cl O N N C C C C C C C C C C C C C C H H H H H H H H H H H H
charge: 0
multiplicity: 1
keywords: wb97x-d3
keywords: def2-TZVPP
keywords: def2/J RIJCOSX GRIDX6 NOFINALGRIDX
keywords: grid4 nofinalgrid
keywords: scfconv7
keywords: smallprint printgap noloewdin
keywords: NOSOSCF
formula: C14H12Cl2N2O
InChI: InChI=1S/C14H12Cl2N2O/c1-19-18-14(7-10-3-2-6-17-9-10)12-5-4-11(15)8-13(12)16/h2-6,8-9H,7H2,1H3
31 atoms
Cl -0.027673 -1.13358 2.876421
Cl -4.614051 -1.929082 0.228131
O  3.2095 -0.667377 -0.623436
N  1.940983 -1.146017 -0.524813
N  2.564679 3.41384 -1.851416
C  1.566418 0.917401 0.790848
C  1.175177 -0.397811 0.166132
C  -0.244127 -0.812709 0.199927
C  1.467088 2.000515 -0.251338
C  -0.904532 -1.123305 1.385661
C  -0.974666 -0.87942 -0.98365
C  0.238282 2.539157 -0.616905
C  2.595302 2.482167 -0.905733
C  -2.245611 -1.466503 1.410837
C  -2.315376 -1.224863 -0.991482
C  -2.939085 -1.507533 0.212047
C  0.191686 3.507295 -1.605994
C  1.380014 3.907642 -2.194689
C  4.006923 -1.545101 -1.398103
H  0.895298 1.149144 1.616952
H  2.575134 0.870781 1.201188
H  -0.485927 -0.642538 -1.918896
H  -0.672454 2.214801 -0.128079
H  3.574809 2.101336 -0.640458
H  -2.734367 -1.707086 2.344437
H  -2.861267 -1.264682 -1.923301
H  -0.74608 3.949249 -1.912524
H  1.3758 4.662941 -2.971428
H  4.072828 -2.537969 -0.94873
H  5.001039 -1.104179 -1.426385
H  3.631504 -1.63695 -2.41911
elementType: Cl O N C H
totalener: -1645.85660562 hartree
nucrepener: 1600.56050040 hartree
electener: -3246.41710602 hartree
oneelecener: -5436.68880279 hartree
twoeener: 2190.27169678 hartree
cpcmener: -0.02116445 hartree
kineticenergy: 1641.45005691 hartree
xcener: -112.967339722080 hartree
chargesum: 0.0000000
charge: -0.071744 -0.081973 -0.231355 -0.126437 -0.370666 -0.040903 0.104651 0.005111 0.022249 0.053268 -0.180235 -0.183940 -0.011527 -0.154097 -0.155889 0.110753 -0.149998 0.009317 -0.111879 0.117504 0.101141 0.153205 0.154850 0.120645 0.129610 0.149938 0.160511 0.148146 0.108730 0.114897 0.106115
qa: -0.0717 -0.0820 -0.2314 -0.1264 -0.3707 -0.0409 0.1047 0.0051 0.0222 0.0533 -0.1802 -0.1839 -0.0115 -0.1541 -0.1559 0.1108 -0.1500 0.0093 -0.1119 0.1175 0.1011 0.1532 0.1548 0.1206 0.1296 0.1499 0.1605 0.1481 0.1087 0.1149 0.1061
va: 1.2549 1.2218 1.9639 2.9192 3.0627 3.8191 3.8778 3.5822 3.5812 3.9084 3.9630 3.9657 4.0653 4.0710 4.0126 3.8614 3.9036 3.9907 3.8805 1.0180 1.0354 1.0076 0.9950 1.0241 1.0201 1.0028 0.9906 0.9979 0.9954 0.9942 0.9948
dispcorr: -0.015451924 hartree
energy: -1645.872057542098
dipole: 19.09696 -19.77622 -0.67925 9.92659 -9.89669 0.02990 -12.75621 12.72665 -0.02957
magnitude: 0.68055 au
magnitude: 1.72983 debye
