program: Orca
programVersion: 4.2.1
elementType: Cl Cl O N N C C C C C C C C C C C C C C H H H H H H H H H H H H
charge: 0
multiplicity: 1
keywords: wb97x-d3
keywords: def2-TZVPP
keywords: def2/J RIJCOSX GRIDX6 NOFINALGRIDX
keywords: grid4 nofinalgrid
keywords: scfconv7
keywords: smallprint printgap noloewdin
keywords: NOSOSCF
formula: C14H12Cl2N2O
InChI: InChI=1S/C14H12Cl2N2O/c1-19-18-14(7-10-3-2-6-17-9-10)12-5-4-11(15)8-13(12)16/h2-6,8-9H,7H2,1H3
31 atoms
Cl -0.079236 -2.315959 -2.037033
Cl -4.567529 -1.974007 0.868246
O  3.22203 -0.275625 0.652678
N  1.96913 -0.758424 0.86713
N  0.202797 3.889752 -0.066091
C  1.444406 0.520476 -1.18633
C  1.137434 -0.391854 -0.025347
C  -0.262004 -0.814018 0.201092
C  1.46698 1.950538 -0.711716
C  -0.928534 -1.660373 -0.680653
C  -0.96477 -0.346207 1.307429
C  2.649798 2.62735 -0.44113
C  0.275875 2.640285 -0.507294
C  -2.249394 -2.02715 -0.489154
C  -2.287131 -0.695382 1.526494
C  -2.916582 -1.530993 0.619368
C  2.588245 3.934814 0.013518
C  1.344979 4.518522 0.191013
C  4.09971 -0.70534 1.677532
H  2.397586 0.25765 -1.645651
H  0.678026 0.405773 -1.952432
H  -0.470593 0.315204 2.00616
H  3.60599 2.145281 -0.594914
H  -0.671205 2.156671 -0.725035
H  -2.742855 -2.691614 -1.184216
H  -2.814557 -0.315136 2.389719
H  3.488091 4.49464 0.227404
H  1.267227 5.538246 0.548638
H  3.785018 -0.343406 2.658211
H  5.072115 -0.279118 1.440008
H  4.188145 -1.793167 1.706991
elementType: Cl O N C H
totalener: -1645.85658127 hartree
nucrepener: 1597.88045566 hartree
electener: -3243.73703694 hartree
oneelecener: -5431.57913142 hartree
twoeener: 2187.84209448 hartree
cpcmener: -0.02083747 hartree
kineticenergy: 1641.45014913 hartree
xcener: -112.966836141609 hartree
chargesum: 0.0000000
charge: -0.071549 -0.082637 -0.230412 -0.125267 -0.368518 -0.035610 0.100745 0.013919 0.015806 0.048791 -0.178787 -0.151138 -0.040700 -0.158454 -0.157594 0.111680 -0.151778 0.006389 -0.111931 0.104393 0.116572 0.153557 0.143934 0.131121 0.129461 0.150026 0.159784 0.148860 0.105607 0.114216 0.109513
qa: -0.0715 -0.0826 -0.2304 -0.1253 -0.3685 -0.0356 0.1007 0.0139 0.0158 0.0488 -0.1788 -0.1511 -0.0407 -0.1585 -0.1576 0.1117 -0.1518 0.0064 -0.1119 0.1044 0.1166 0.1536 0.1439 0.1311 0.1295 0.1500 0.1598 0.1489 0.1056 0.1142 0.1095
va: 1.2556 1.2211 1.9668 2.9154 3.0602 3.8132 3.8826 3.5825 3.5845 3.9198 3.9654 3.9624 4.0724 4.0750 4.0115 3.8605 3.9088 3.9903 3.8809 1.0307 1.0162 1.0072 1.0143 1.0070 1.0204 1.0031 0.9904 0.9979 0.9949 0.9939 0.9951
dispcorr: -0.015385232 hartree
energy: -1645.871966506553
dipole: 22.98004 -21.45444 1.52561 15.23528 -15.14341 0.09187 6.06619 -5.93709 0.12911
magnitude: 1.53381 au
magnitude: 3.89864 debye
