program: Orca
programVersion: 4.2.1
elementType: Cl Cl O N N C C C C C C C C C C C C C C H H H H H H H H H H H H
charge: 0
multiplicity: 1
keywords: wb97x-d3
keywords: def2-TZVPP
keywords: def2/J RIJCOSX GRIDX6 NOFINALGRIDX
keywords: grid4 nofinalgrid
keywords: scfconv7
keywords: smallprint printgap noloewdin
keywords: NOSOSCF
formula: C14H12Cl2N2O
InChI: InChI=1S/C14H12Cl2N2O/c1-19-18-14(7-10-3-2-6-17-9-10)12-5-4-11(15)8-13(12)16/h2-6,8-9H,7H2,1H3
31 atoms
Cl -0.38301 -2.336577 -2.005489
Cl -4.438281 -1.308565 1.341462
O  3.462738 -0.83811 0.212259
N  2.18217 -1.151144 0.553271
N  2.217997 3.713545 0.31181
C  1.559911 0.378875 -1.306313
C  1.307841 -0.587315 -0.180405
C  -0.102097 -0.817373 0.210776
C  1.334835 1.781946 -0.807621
C  -0.975338 -1.55835 -0.578831
C  -0.606699 -0.242204 1.372584
C  0.097605 2.404228 -0.913599
C  2.354731 2.487943 -0.178593
C  -2.309016 -1.721162 -0.244453
C  -1.935031 -0.388453 1.735955
C  -2.774098 -1.123444 0.915558
C  -0.060198 3.682967 -0.404162
C  1.027281 4.293479 0.197191
C  4.37471 -1.55197 1.027396
H  2.567004 0.269161 -1.704682
H  0.867224 0.172231 -2.122949
H  0.050291 0.340932 2.003496
H  -0.731687 1.900101 -1.394546
H  3.33562 2.036434 -0.074512
H  -2.966889 -2.305707 -0.871777
H  -2.304935 0.070497 2.641753
H  -1.00665 4.200526 -0.474367
H  0.933293 5.293563 0.6029
H  4.251531 -1.307289 2.084209
H  5.368339 -1.245196 0.707831
H  4.278913 -2.631638 0.895313
elementType: Cl O N C H
totalener: -1645.85638179 hartree
nucrepener: 1608.54919842 hartree
electener: -3254.40558020 hartree
oneelecener: -5452.67464489 hartree
twoeener: 2198.26906468 hartree
cpcmener: -0.02107779 hartree
kineticenergy: 1641.45627854 hartree
xcener: -112.968156460979 hartree
chargesum: 0.0000000
charge: -0.072172 -0.082547 -0.236019 -0.124420 -0.368915 -0.049161 0.093363 0.000030 0.024311 0.070887 -0.167104 -0.186511 -0.009449 -0.165433 -0.163002 0.118601 -0.140321 0.005203 -0.109715 0.105958 0.119372 0.149339 0.147018 0.124731 0.128174 0.150193 0.160772 0.149000 0.104678 0.115823 0.107315
qa: -0.0722 -0.0825 -0.2360 -0.1244 -0.3689 -0.0492 0.0934 0.0000 0.0243 0.0709 -0.1671 -0.1865 -0.0094 -0.1654 -0.1630 0.1186 -0.1403 0.0052 -0.1097 0.1060 0.1194 0.1493 0.1470 0.1247 0.1282 0.1502 0.1608 0.1490 0.1047 0.1158 0.1073
va: 1.2536 1.2210 1.9533 2.9104 3.0639 3.8157 3.8824 3.6302 3.5738 3.8923 3.9535 3.9633 4.0575 4.0904 4.0188 3.8556 3.9004 3.9959 3.8797 1.0403 1.0179 1.0049 1.0005 1.0244 1.0211 1.0026 0.9896 0.9980 0.9958 0.9943 0.9949
dispcorr: -0.015687434 hartree
energy: -1645.872069219472
dipole: 20.27083 -20.78107 -0.51024 11.71516 -11.67180 0.04337 2.92081 -3.23325 -0.31244
magnitude: 0.59987 au
magnitude: 1.52474 debye
