program: Orca
programVersion: 4.2.1
elementType: Cl Cl O N N C C C C C C C C C C C C C C H H H H H H H H H H H H
charge: 0
multiplicity: 1
keywords: wb97x-d3
keywords: def2-TZVPP
keywords: def2/J RIJCOSX GRIDX6 NOFINALGRIDX
keywords: grid4 nofinalgrid
keywords: scfconv7
keywords: smallprint printgap noloewdin
keywords: NOSOSCF
formula: C14H12Cl2N2O
InChI: InChI=1S/C14H12Cl2N2O/c1-19-18-14(7-10-3-2-6-17-9-10)12-5-4-11(15)8-13(12)16/h2-6,8-9H,7H2,1H3
31 atoms
Cl -0.383537 -2.339346 -2.001122
Cl -4.440035 -1.303517 1.341076
O  3.462448 -0.835714 0.209276
N  2.182166 -1.149842 0.553101
N  2.221452 3.7159 0.301661
C  1.557019 0.3786 -1.307477
C  1.306403 -0.586367 -0.179079
C  -0.10307 -0.816808 0.213149
C  1.334195 1.782214 -0.810235
C  -0.976207 -1.558056 -0.57672
C  -0.607674 -0.240924 1.374735
C  0.097108 2.405504 -0.914458
C  2.356375 2.488911 -0.18562
C  -2.309982 -1.720523 -0.242203
C  -1.936561 -0.385314 1.736733
C  -2.775613 -1.121317 0.916897
C  -0.058737 3.685692 -0.407898
C  1.031062 4.296889 0.188929
C  4.374646 -1.543198 1.029983
H  2.563383 0.267246 -1.707335
H  0.862647 0.170986 -2.122486
H  0.049743 0.342763 2.004751
H  -0.733518 1.900677 -1.392563
H  3.337606 2.037577 -0.083654
H  -2.967762 -2.305987 -0.868943
H  -2.307737 0.075719 2.641035
H  -1.005266 4.203373 -0.476849
H  0.939868 5.297939 0.593076
H  4.28334 -2.623636 0.901267
H  4.246911 -1.295506 2.085491
H  5.368417 -1.233906 0.713063
elementType: Cl O N C H
totalener: -1645.85639678 hartree
nucrepener: 1608.43918898 hartree
electener: -3254.29558576 hartree
oneelecener: -5452.45459867 hartree
twoeener: 2198.15901291 hartree
cpcmener: -0.02107507 hartree
kineticenergy: 1641.45235094 hartree
xcener: -112.967368954130 hartree
chargesum: -0.0000000
charge: -0.071940 -0.082261 -0.236281 -0.124538 -0.369045 -0.049162 0.093817 -0.000316 0.024122 0.070757 -0.167152 -0.186425 -0.009459 -0.165394 -0.162946 0.118355 -0.140500 0.005305 -0.109736 0.106011 0.119551 0.149553 0.146980 0.124776 0.128173 0.150131 0.160824 0.149035 0.107353 0.104633 0.115781
qa: -0.0719 -0.0823 -0.2363 -0.1245 -0.3690 -0.0492 0.0938 -0.0003 0.0241 0.0708 -0.1672 -0.1864 -0.0095 -0.1654 -0.1629 0.1184 -0.1405 0.0053 -0.1097 0.1060 0.1196 0.1496 0.1470 0.1248 0.1282 0.1501 0.1608 0.1490 0.1074 0.1046 0.1158
va: 1.2539 1.2214 1.9530 2.9101 3.0637 3.8155 3.8820 3.6316 3.5740 3.8923 3.9541 3.9630 4.0578 4.0902 4.0187 3.8559 3.9007 3.9958 3.8797 1.0403 1.0178 1.0049 1.0006 1.0243 1.0211 1.0026 0.9895 0.9979 0.9949 0.9959 0.9943
dispcorr: -0.015683954 hartree
energy: -1645.872080735176
dipole: 20.27289 -20.78962 -0.51673 11.73770 -11.69151 0.04620 2.91463 -3.22135 -0.30672
magnitude: 0.60268 au
magnitude: 1.53189 debye
