program: Orca
programVersion: 4.2.1
elementType: Cl Cl O N N C C C C C C C C C C C C C C H H H H H H H H H H H H
charge: 0
multiplicity: 1
keywords: wb97x-d3
keywords: def2-TZVPP
keywords: def2/J RIJCOSX GRIDX6 NOFINALGRIDX
keywords: grid4 nofinalgrid
keywords: scfconv7
keywords: smallprint printgap noloewdin
keywords: NOSOSCF
formula: C14H12Cl2N2O
InChI: InChI=1S/C14H12Cl2N2O/c1-19-18-14(7-10-3-2-6-17-9-10)12-5-4-11(15)8-13(12)16/h2-6,8-9H,7H2,1H3
31 atoms
Cl -0.691337 -2.065321 -2.189618
Cl -4.45297 -1.806066 1.614854
O  3.23939 -0.445947 0.071454
N  2.017811 -0.890909 0.456178
N  2.873605 3.745575 -0.352093
C  1.233583 0.520093 -1.412598
C  1.070774 -0.451445 -0.270067
C  -0.286955 -0.827167 0.182438
C  1.413057 1.912864 -0.865451
C  -1.18747 -1.517502 -0.62492
C  -0.709346 -0.470485 1.460851
C  0.33902 2.624704 -0.342284
C  2.658341 2.532601 -0.843736
C  -2.468884 -1.825255 -0.199577
C  -1.982641 -0.767278 1.915887
C  -2.853996 -1.436861 1.073416
C  0.553307 3.889475 0.179534
C  1.839687 4.404784 0.155294
C  4.241367 -0.962116 0.927007
H  2.083956 0.242595 -2.037062
H  0.35015 0.495867 -2.049883
H  -0.029009 0.062632 2.111325
H  -0.658613 2.201819 -0.348596
H  3.521737 2.021296 -1.255646
H  -3.147454 -2.366087 -0.844395
H  -2.28558 -0.473496 2.910997
H  -0.260678 4.469307 0.592677
H  2.040165 5.391897 0.556502
H  5.18667 -0.571194 0.555438
H  4.274023 -2.053645 0.901768
H  4.102012 -0.630763 1.958545
elementType: Cl O N C H
totalener: -1645.86335560 hartree
nucrepener: 1597.40446214 hartree
electener: -3243.26781774 hartree
oneelecener: -5430.34368849 hartree
twoeener: 2187.07587075 hartree
cpcmener: -0.01835067 hartree
kineticenergy: 1641.45071551 hartree
xcener: -112.967486782598 hartree
chargesum: 0.0000000
charge: -0.071615 -0.080905 -0.223562 -0.120456 -0.361215 -0.046521 0.100653 0.017351 0.019834 0.042328 -0.178392 -0.176679 -0.010714 -0.148860 -0.151151 0.105288 -0.151801 0.009371 -0.113396 0.103417 0.114966 0.149096 0.151766 0.116811 0.127212 0.147216 0.156189 0.146119 0.112998 0.108913 0.105738
qa: -0.0716 -0.0809 -0.2236 -0.1205 -0.3612 -0.0465 0.1007 0.0174 0.0198 0.0423 -0.1784 -0.1767 -0.0107 -0.1489 -0.1512 0.1053 -0.1518 0.0094 -0.1134 0.1034 0.1150 0.1491 0.1518 0.1168 0.1272 0.1472 0.1562 0.1461 0.1130 0.1089 0.1057
va: 1.2546 1.2229 1.9713 2.9252 3.0675 3.8254 3.8740 3.5809 3.5878 3.9210 3.9672 3.9654 4.0690 4.0640 4.0085 3.8716 3.9064 3.9932 3.8845 1.0316 1.0175 1.0107 0.9957 1.0238 1.0206 1.0038 0.9922 0.9980 0.9942 0.9955 0.9946
dispcorr: -0.015346973 hartree
energy: -1645.878702574615
dipole: 21.22972 -21.81449 -0.58477 13.56691 -13.50953 0.05738 3.59692 -3.29690 0.30002
magnitude: 0.65974 au
magnitude: 1.67694 debye
