program: Gaussian 09
title: 000034344
version: EM64L-G09RevD.01
frameworkgroup: C1[X(C8H8Br2)]
method: RPBEPBE
basis: SDD
operation: Freq
keyword: #pfreq=noraman
keyword: PBEPBE/SDD
title: #p freq=noraman PBEPBE/SDD
converged: YES YES NO NO
title: Mulliken charges:
elementType: Br Br C C C C C C C C H H H H H H H H
charge: 0.003752 0.002501 0.580477 0.549112 -0.491516 -0.407095 -0.432652 -0.180432 -0.802460 -0.819924 0.245710 0.253922 0.258253 0.258361 0.242400 0.255010 0.255048 0.229533
chargesum: 0.00000
title: Mulliken charges with hydrogens summed into heavy atoms:
elementType: Br Br C C C C C C C C
charge: 0.003752 0.002501 0.580477 0.549112 -0.491516 -0.407095 -0.186942 0.073490 -0.043446 -0.080333
polarizability: 1.73199433e+02 -8.61418860e-01 1.27498709e+02 -1.21065123e-02 4.40633903e-03 5.17108016e+01
1716.lowfreq: -9.1207 -0.0002 0.0002 0.0005 4.7917 6.1836 71.9881 103.9764 135.0353
frequency: 71.9729 103.9760 135.0342 146.7556 168.0906 227.4625 239.6726 251.3903 278.3001 297.7733 359.3885 478.2466 507.7006 548.7308 550.8537 599.9599 713.8013 739.1784 812.4943 919.4662 950.5037 990.7561 1015.7860 1038.0788 1039.2573 1046.6495 1151.1875 1209.0182 1266.0475 1341.7380 1368.1952 1400.5009 1402.7503 1429.0505 1463.2187 1468.4443 1470.0522 1472.8635 1564.2464 1581.7533 2984.7158 2991.7921 3063.9341 3066.8188 3093.9429 3121.6928 3142.7563 3175.8167
redmass: 4.0482 3.5642 1.0724 22.5118 1.0289 4.6605 3.6975 10.0115 4.6269 4.1199 3.5082 3.0908 3.7382 5.8761 3.9566 5.5919 4.1875 6.3815 1.2809 2.8783 1.3409 1.4845 7.6810 1.7487 1.4985 1.5293 1.5280 1.7032 3.0422 6.6470 4.0398 1.2757 1.2152 2.2134 1.0444 1.1836 1.0437 1.1188 5.3588 8.1568 1.0370 1.0390 1.0971 1.0972 1.0996 1.0972 1.0895 1.0961
irintensity: 0.1108 0.5007 0.7243 0.0050 0.3427 1.3099 9.6729 1.6340 4.4795 0.0989 0.9699 0.6782 0.0470 0.2772 4.7375 30.9262 1.6217 31.1175 36.4463 14.9930 0.0368 65.2645 37.4424 0.4669 6.9866 9.0453 5.5707 3.4817 3.4638 11.8665 27.2762 27.4884 11.3857 31.3616 14.5457 32.1077 13.8302 28.3148 21.9069 7.9539 21.0987 10.5292 12.6900 10.3303 19.2848 7.5762 8.3874 5.3317
temp: 298.150 k
press: 1.00000 atm
elementType: 35 35 6 6 6 6 6 6 6 6 1 1 1 1 1 1 1 1
symmnumber: 1
zpe: 349679.3 jmol-1
zpe.correction: 0.133186 hartree
zpe.thermalcorrener: 0.143852 hartree
zpe.thermalcorrenthalpy: 0.144796 hartree
zpe.thermalcorrgfe: 0.095118 hartree
zpe.sumelectzpe: -335.844107 hartree
zpe.sumelectthermal: -335.833441 hartree
zpe.sumelectthermalent: -335.832497 hartree
zpe.sumelectthermalfe: -335.882174 hartree
dipole: -0.8352 1.4300 0.0006
dipole: 1.6560
quadrupole: -79.6094 -68.5280 -81.1192
quadrupole: -2.2809 -0.0013 0.0008
quadrupole: -3.1905 7.8909 -4.7004 -2.2809 -0.0013 0.0008
hfenergy: -335.9772926 hartree
pointgroup: C01 [X(C8H8Br2)]
dipole: -0.4907775 -0.4284874 -0.0032547 debye
dipolederiv: -0.3258127 0.302245 -0.0074824 0.3440518 -0.4592823 0.0092774 -0.0077106 0.0087452 -0.039166 -0.7609942 0.0253126 -0.0111181 0.0032075 -0.0740456 0.0003288 -0.0109658 0.0008156 -0.0414089 -0.4848997 0.2598706 -0.0111164 0.251311 0.0603523 0.003913 -0.0107771 0.0041885 0.0745724 0.2049546 0.2256524 0.0005115 0.098541 -0.2701991 0.0045267 0.0026364 0.006617 0.0367982 0.4203475 -0.6252413 0.0154173 -0.5997452 0.7034123 -0.0177111 0.0147938 -0.0180686 -0.1781271 1.2562472 -0.0331503 0.0217491 -0.0719306 -0.014112 -0.0023577 0.0221855 -0.0018823 -0.1503141 -0.0333244 -0.0976145 0.0031996 0.0176583 0.0395225 -0.0019632 0.0020317 -0.0035867 -0.1795268 -0.3377526 -0.0504363 -0.003554 -0.0102423 -0.0007963 -0.0008833 -0.0039688 -0.0016239 -0.0753646 0.0321485 0.0036295 -0.0002438 -0.0722919 -0.1786557 0.0011804 0.0000331 0.0019233 0.0502893 -0.1671453 0.0105098 -0.0034526 0.0540337 0.1130109 0.0001915 -0.0052598 -0.0013453 0.0468324 0.0041741 -0.0707151 -0.0015615 -0.0542517 -0.0700208 0.0015343 -0.0016726 0.0014262 0.1609072 0.038826 0.0784172 -0.002599 0.0700368 0.0009793 0.0026779 -0.0025684 0.0028426 0.16101 0.0821 0.0113061 -0.0699666 -0.005992 0.0161553 0.0614505 -0.0402723 0.0878747 -0.0237806 0.0794414 0.0143472 0.0718434 -0.0039305 0.0131399 -0.0622456 0.0429417 -0.0882641 -0.018538 -0.0853152 -0.0561694 -0.0016612 0.0283338 0.1246492 0.0000626 -0.002634 -0.0008392 0.1158601 -0.0007699 0.0009909 0.0466115 0.0349118 0.0688823 -0.088515 0.0874693 -0.0610049 -0.0213594 0.0026176 -0.002394 -0.0460343 0.0294086 0.0733731 0.0863031 -0.0874742 0.0583807 -0.0303972 0.0751571 0.0034397 -0.0005425 -0.11311 -0.1463653 0.0022296 0.0012122 0.0038012 0.1117131 unknown
polarizability: 169.0461024|-13.1061575|131.6130292|1.9058999|-1.0076963|51.7498118 unknown
InChI: InChI=1S/C8H8Br2/c1-5-3-4-7(9)6(2)8(5)10/h3-4H,1-2H3
charge 0 multiplicity 1
18 atoms
Br -1.91837 2.169652 -0.045121
Br 3.409966 -0.316344 0.060055
C  0.654232 0.77961 0.006946
C  -1.385071 -0.697748 -0.008185
C  -0.755885 0.572886 -0.011867
C  1.439086 -0.405333 0.030943
C  -0.530908 -1.829311 0.015943
C  0.870699 -1.694319 0.035534
C  1.247223 2.17197 0.001386
C  -2.888775 -0.876008 -0.028911
H  -0.974859 -2.830435 0.019614
H  1.512194 -2.57928 0.05424
H  0.922099 2.731838 -0.894405
H  0.901872 2.747597 0.879488
H  2.346312 2.143532 0.014298
H  -3.364721 -0.389437 0.84222
H  -3.336546 -0.417391 -0.929765
H  -3.155949 -1.94578 -0.016413
