program: Orca
programVersion: 4.2.1
elementType: Cl Cl O N N C C C C C C C C C C C C C C H H H H H H H H H H H H
charge: 0
multiplicity: 1
keywords: wb97x-d3
keywords: def2-TZVPP
keywords: def2/J RIJCOSX GRIDX6 NOFINALGRIDX
keywords: grid4 nofinalgrid
keywords: scfconv7
keywords: smallprint printgap noloewdin
keywords: NOSOSCF
formula: C14H12Cl2N2O
InChI: InChI=1S/C14H12Cl2N2O/c1-19-18-14(7-10-3-2-6-17-9-10)12-5-4-11(15)8-13(12)16/h2-6,8-9H,7H2,1H3
31 atoms
Cl -0.092499 -2.323199 -2.047302
Cl -4.562493 -1.769765 0.855159
O  3.280965 -0.349099 0.705152
N  2.014629 -0.803585 0.886061
N  0.053084 3.780391 -0.220198
C  1.548502 0.468833 -1.185421
C  1.210129 -0.43512 -0.026012
C  -0.204163 -0.813041 0.193178
C  1.461364 1.903277 -0.731364
C  -0.908936 -1.625822 -0.690316
C  -0.884863 -0.322092 1.303747
C  2.579064 2.63553 -0.349871
C  0.224665 2.538173 -0.649314
C  -2.246228 -1.930407 -0.499995
C  -2.221499 -0.609832 1.522296
C  -2.890646 -1.407842 0.609784
C  2.412336 3.938973 0.090786
C  1.130618 4.463106 0.146609
C  4.122977 -0.826416 1.737554
H  2.542722 0.249254 -1.57456
H  0.842591 0.303362 -1.999295
H  -0.359839 0.31034 2.007048
H  3.5679 2.199067 -0.405034
H  -0.673389 2.01188 -0.958987
H  -2.77032 -2.568234 -1.197956
H  -2.728921 -0.209799 2.388775
H  3.26023 4.541375 0.387183
H  0.968469 5.47675 0.495754
H  3.79734 -0.476651 2.719839
H  5.11318 -0.42514 1.530008
H  4.177311 -1.917398 1.745214
elementType: Cl O N C H
totalener: -1645.86329737 hartree
nucrepener: 1601.57647777 hartree
electener: -3247.43977514 hartree
oneelecener: -5438.93621966 hartree
twoeener: 2191.49644453 hartree
cpcmener: -0.01803720 hartree
kineticenergy: 1641.45097166 hartree
xcener: -112.967118812428 hartree
chargesum: -0.0000000
charge: -0.071637 -0.081087 -0.227655 -0.119358 -0.357965 -0.050385 0.097841 0.008238 0.023639 0.053060 -0.171395 -0.147892 -0.045867 -0.156990 -0.153795 0.110658 -0.149425 0.006665 -0.111774 0.101163 0.119356 0.149945 0.141288 0.128946 0.127813 0.147643 0.156735 0.146374 0.104605 0.113122 0.108137
qa: -0.0716 -0.0811 -0.2277 -0.1194 -0.3580 -0.0504 0.0978 0.0082 0.0236 0.0531 -0.1714 -0.1479 -0.0459 -0.1570 -0.1538 0.1107 -0.1494 0.0067 -0.1118 0.1012 0.1194 0.1499 0.1413 0.1289 0.1278 0.1476 0.1567 0.1464 0.1046 0.1131 0.1081
va: 1.2546 1.2225 1.9674 2.9201 3.0632 3.8232 3.8864 3.5898 3.5749 3.9096 3.9609 3.9659 4.0742 4.0732 4.0145 3.8666 3.9082 3.9931 3.8848 1.0338 1.0175 1.0085 1.0150 1.0071 1.0206 1.0036 0.9913 0.9979 0.9952 0.9940 0.9953
dispcorr: -0.015464883 hartree
energy: -1645.878762252012
dipole: 22.99638 -21.45695 1.53943 14.51783 -14.40562 0.11221 6.39962 -6.14003 0.25959
magnitude: 1.56519 au
magnitude: 3.97839 debye
