program: Orca
programVersion: 4.2.1
elementType: Cl Cl O N N C C C C C C C C C C C C C C H H H H H H H H H H H H
charge: 0
multiplicity: 1
keywords: wb97x-d3
keywords: def2-TZVPP
keywords: def2/J RIJCOSX GRIDX6 NOFINALGRIDX
keywords: grid4 nofinalgrid
keywords: scfconv7
keywords: smallprint printgap noloewdin
keywords: NOSOSCF
formula: C14H12Cl2N2O
InChI: InChI=1S/C14H12Cl2N2O/c1-19-18-14(7-10-3-2-6-17-9-10)12-5-4-11(15)8-13(12)16/h2-6,8-9H,7H2,1H3
31 atoms
Cl -0.415726 -2.315777 -2.040811
Cl -4.439258 -1.394753 1.374395
O  3.437241 -0.791816 0.226927
N  2.158196 -1.115294 0.556946
N  2.276128 3.69936 0.281831
C  1.538475 0.378033 -1.329144
C  1.284776 -0.581581 -0.194567
C  -0.122876 -0.827598 0.197472
C  1.349706 1.786201 -0.829306
C  -0.997407 -1.564977 -0.594901
C  -0.620622 -0.281373 1.376539
C  0.122054 2.430577 -0.915611
C  2.391437 2.476219 -0.215872
C  -2.32492 -1.749369 -0.246642
C  -1.942544 -0.449454 1.752779
C  -2.783719 -1.179201 0.929703
C  -0.010001 3.709139 -0.398371
C  1.095078 4.29939 0.192762
C  4.343165 -1.49203 1.059073
H  2.537835 0.244371 -1.740782
H  0.831384 0.18376 -2.136006
H  0.039197 0.294756 2.011434
H  -0.721989 1.942406 -1.387952
H  3.367997 2.011188 -0.127168
H  -2.983092 -2.331931 -0.876036
H  -2.30662 -0.012287 2.671998
H  -0.950221 4.240507 -0.453313
H  1.025289 5.298565 0.607664
H  4.199226 -1.244846 2.113269
H  5.339753 -1.176575 0.755338
H  4.260043 -2.573613 0.92975
elementType: Cl O N C H
totalener: -1645.86328542 hartree
nucrepener: 1606.79834262 hartree
electener: -3252.66162804 hartree
oneelecener: -5449.15147043 hartree
twoeener: 2196.48984239 hartree
cpcmener: -0.01822520 hartree
kineticenergy: 1641.45582137 hartree
xcener: -112.967763428073 hartree
chargesum: -0.0000000
charge: -0.071601 -0.080961 -0.230309 -0.119317 -0.360189 -0.052350 0.093449 0.009156 0.023614 0.062429 -0.170462 -0.188076 -0.007812 -0.161583 -0.157899 0.114570 -0.138209 0.005640 -0.110332 0.106750 0.116324 0.147184 0.143934 0.123194 0.127006 0.147580 0.157197 0.146243 0.104059 0.113887 0.106884
qa: -0.0716 -0.0810 -0.2303 -0.1193 -0.3602 -0.0524 0.0934 0.0092 0.0236 0.0624 -0.1705 -0.1881 -0.0078 -0.1616 -0.1579 0.1146 -0.1382 0.0056 -0.1103 0.1068 0.1163 0.1472 0.1439 0.1232 0.1270 0.1476 0.1572 0.1462 0.1041 0.1139 0.1069
va: 1.2539 1.2227 1.9594 2.9166 3.0686 3.8191 3.8780 3.6260 3.5784 3.8960 3.9574 3.9656 4.0592 4.0832 4.0161 3.8647 3.9001 3.9987 3.8837 1.0388 1.0186 1.0067 1.0017 1.0246 1.0212 1.0035 0.9906 0.9981 0.9961 0.9945 0.9950
dispcorr: -0.015609401 hartree
energy: -1645.878894822042
dipole: 20.33580 -20.78902 -0.45322 11.94581 -11.92214 0.02367 3.02064 -3.28637 -0.26573
magnitude: 0.52591 au
magnitude: 1.33676 debye
