program: Orca
programVersion: 4.2.1
elementType: Cl Cl O N N C C C C C C C C C C C C C C H H H H H H H H H H H H
charge: 0
multiplicity: 1
keywords: wb97x-d3
keywords: def2-TZVPP
keywords: def2/J RIJCOSX GRIDX6 NOFINALGRIDX
keywords: grid4 nofinalgrid
keywords: scfconv7
keywords: smallprint printgap noloewdin
keywords: NOSOSCF
formula: C14H12Cl2N2O
InChI: InChI=1S/C14H12Cl2N2O/c1-19-18-14(7-10-3-2-6-17-9-10)12-5-4-11(15)8-13(12)16/h2-6,8-9H,7H2,1H3
31 atoms
Cl 0.103149 -0.859743 2.831557
Cl -4.449027 -1.174587 0.031059
O  3.526721 -1.354129 -0.421817
N  2.189007 -1.585006 -0.347071
N  1.253744 3.023448 -2.36449
C  2.037779 0.746035 0.518399
C  1.517094 -0.610314 0.112132
C  0.046663 -0.812001 0.123983
C  1.35866 1.813427 -0.295392
C  -0.69692 -0.883919 1.297061
C  -0.642885 -0.878104 -1.083061
C  0.215333 2.466697 0.146488
C  1.82983 2.138118 -1.56313
C  -2.077789 -0.998813 1.284489
C  -2.020953 -0.995365 -1.128968
C  -2.726217 -1.045929 0.061905
C  -0.396479 3.393363 -0.68143
C  0.158072 3.633427 -1.928632
C  4.183814 -2.492618 -0.946543
H  1.840671 0.906928 1.580164
H  3.117458 0.799562 0.391254
H  -0.087889 -0.820078 -2.010053
H  -0.19345 2.256692 1.127783
H  2.721928 1.650551 -1.945951
H  -2.632969 -1.056234 2.210314
H  -2.532697 -1.03744 -2.080226
H  -1.287665 3.920097 -0.368657
H  -0.298021 4.351544 -2.600789
H  4.057769 -3.366654 -0.303388
H  5.24132 -2.238311 -0.992031
H  3.834848 -2.735095 -1.952962
elementType: Cl O N C H
totalener: -1645.86193053 hartree
nucrepener: 1623.15639559 hartree
electener: -3269.01832612 hartree
oneelecener: -5481.89062165 hartree
twoeener: 2212.87229552 hartree
cpcmener: -0.01822309 hartree
kineticenergy: 1641.45411789 hartree
xcener: -112.968067939004 hartree
chargesum: -0.0000000
charge: -0.072556 -0.081246 -0.234044 -0.117935 -0.356618 -0.105561 0.097948 0.012770 0.053940 0.038533 -0.155040 -0.163338 -0.021245 -0.142715 -0.178813 0.115942 -0.145601 0.006977 -0.107484 0.124710 0.115632 0.144104 0.142254 0.128142 0.127066 0.147580 0.157385 0.146603 0.104696 0.114617 0.103297
qa: -0.0726 -0.0812 -0.2340 -0.1179 -0.3566 -0.1056 0.0979 0.0128 0.0539 0.0385 -0.1550 -0.1633 -0.0212 -0.1427 -0.1788 0.1159 -0.1456 0.0070 -0.1075 0.1247 0.1156 0.1441 0.1423 0.1281 0.1271 0.1476 0.1574 0.1466 0.1047 0.1146 0.1033
va: 1.2503 1.2221 1.9549 2.9233 3.0675 3.8303 3.8423 3.6762 3.5390 3.8923 3.9656 3.9685 4.0682 4.0692 4.0323 3.8644 3.9109 3.9982 3.8851 1.0174 1.0425 1.0085 1.0014 1.0155 1.0208 1.0037 0.9905 0.9980 0.9945 0.9945 0.9953
dispcorr: -0.016105452 hartree
energy: -1645.878035983988
dipole: 18.89389 -18.90421 -0.01032 5.33988 -5.27633 0.06355 -10.39962 10.84416 0.44455
magnitude: 0.44918 au
magnitude: 1.14173 debye
