program: Gaussian 09
title: 000034335
version: EM64L-G09RevD.01
frameworkgroup: C1[X(C8H12O)]
method: RPBEPBE
basis: SDD
operation: Freq
keyword: #pfreq=noraman
keyword: PBEPBE/SDD
title: #p freq=noraman PBEPBE/SDD
converged: YES YES NO NO
title: Mulliken charges:
elementType: O C C C C C C C C H H H H H H H H H H H H
charge: -0.216372 -0.162246 -0.546463 0.315603 0.124428 -0.000005 -0.732664 -0.832572 -0.800146 0.231819 0.248055 0.246427 0.226273 0.226114 0.221549 0.242611 0.233929 0.245817 0.229243 0.224997 0.273603
chargesum: 0.00000
title: Mulliken charges with hydrogens summed into heavy atoms:
elementType: O C C C C C C C C
charge: -0.216372 0.069573 -0.051981 0.315603 0.124428 -0.000005 -0.058727 -0.110215 -0.072303
polarizability: 1.10743872e+02 -5.61552910e+00 9.25547340e+01 3.65586908e+00 6.20235045e-01 6.07051492e+01
1716.lowfreq: -20.3868 -16.7988 -9.4222 -0.0009 -0.0007 -0.0004 38.4765 54.9832 110.9365
frequency: 37.7225 54.7853 110.9297 121.5795 210.8942 249.4406 265.5184 284.4694 314.6510 373.7218 489.0365 530.7754 538.4294 588.4918 642.6512 665.9036 808.2855 889.9831 911.2160 956.1886 985.4476 1028.6663 1046.4029 1061.0959 1063.9652 1107.7929 1118.0188 1171.4497 1206.5558 1237.6424 1286.5378 1295.0043 1329.5022 1388.2855 1393.4306 1395.5118 1433.4109 1456.0580 1461.8167 1469.8241 1479.7037 1481.6095 1485.1823 1612.1797 1661.3635 2958.0336 2966.6064 2977.3013 2978.4415 3008.4859 3036.0635 3058.4362 3066.1505 3077.2657 3078.3156 3084.5549 3091.0797
redmass: 1.1578 2.0349 2.3357 1.2211 2.0471 2.2460 1.2506 2.5097 3.3129 3.0505 2.6478 3.1898 4.7953 3.3621 4.3723 3.0308 2.2580 1.8220 1.9048 1.5803 1.2954 1.6885 1.6639 1.8046 3.5175 2.1656 1.8982 1.5199 1.9712 1.4817 2.0689 1.5948 3.2587 1.2046 1.3750 1.2286 1.0850 1.0871 1.0525 1.0567 1.0525 1.0493 1.0486 11.3247 8.3253 1.0818 1.0394 1.0365 1.0353 1.0620 1.0954 1.0979 1.1008 1.0998 1.1000 1.0987 1.0975
irintensity: 1.4608 0.8190 1.3753 2.2582 1.5411 2.1880 0.2166 3.1914 4.0687 0.6516 2.0568 4.0584 4.2689 1.6169 4.8569 1.8178 2.4509 4.1429 5.1586 0.1250 4.6899 4.3878 6.9798 2.2759 49.7573 7.2307 6.1064 2.3382 9.2187 0.8177 18.1730 1.9762 29.4663 13.9101 25.9364 30.6673 18.8500 7.3431 25.1636 32.8466 5.6957 4.0585 7.0385 306.3584 4.1636 19.2614 22.0671 35.7204 25.7139 9.5199 17.5732 20.9594 9.9451 36.6296 33.9553 5.9222 16.8400
temp: 298.150 k
press: 1.00000 atm
elementType: 8 6 6 6 6 6 6 6 6 1 1 1 1 1 1 1 1 1 1 1 1
symmnumber: 1
zpe: 467033.3 jmol-1
zpe.correction: 0.177884 hartree
zpe.thermalcorrener: 0.188134 hartree
zpe.thermalcorrenthalpy: 0.189078 hartree
zpe.thermalcorrgfe: 0.141761 hartree
zpe.sumelectzpe: -386.578215 hartree
zpe.sumelectthermal: -386.567965 hartree
zpe.sumelectthermalent: -386.567020 hartree
zpe.sumelectthermalfe: -386.614337 hartree
dipole: -4.0704 2.1347 -0.3701
dipole: 4.6111
quadrupole: -61.7560 -53.5611 -54.1136
quadrupole: 6.1540 0.1396 0.6678
quadrupole: -5.2791 2.9158 2.3633 6.1540 0.1396 0.6678
hfenergy: -386.7560982 hartree
pointgroup: C01 [X(C8H12O1)]
dipole: -1.6706301 0.7071702 -0.0030751 debye
dipolederiv: -1.1530383 0.244671 0.0050753 0.2889908 -0.6157123 -0.0187845 -0.0198586 -0.0181243 -0.3440243 -0.0353101 -0.0339096 0.0078305 0.0267562 -0.0365668 -0.0100392 0.0136779 -0.0136179 0.1696397 -0.274253 -0.1634606 -0.0200654 -0.244164 -0.2318617 -0.0378442 -0.0280954 -0.0462222 0.0924523 0.4992008 -0.3099478 0.0049139 -0.0754232 0.2413809 0.0207121 0.0877692 0.0500652 -0.1033087 -0.3918113 0.4333165 0.0567958 0.6003069 -0.3412498 0.0152205 0.0549653 -0.0039903 -0.0643043 1.2133443 -0.1978347 0.0244466 -0.5421835 1.0125942 0.0803155 0.0065706 0.1031992 0.1335712 0.0541009 -0.0117588 0.0640347 -0.0700955 0.0447291 0.0219502 -0.0025789 -0.0180391 0.0406446 -0.1275804 0.1551895 0.0181014 0.0693714 -0.1506578 -0.0243555 0.039372 -0.050343 0.0554562 -0.0059106 -0.0296562 -0.0056534 -0.133745 -0.1162912 -0.0404243 -0.0327937 -0.0409013 0.0904266 -0.0198807 0.0021389 -0.0745107 -0.0383615 0.0383216 0.0139429 -0.1023513 0.0057846 -0.1214696 0.0578937 -0.0002658 0.0110837 0.027823 0.0432507 -0.076002 0.0206602 -0.1172343 -0.0363632 0.0709171 -0.0259531 0.0075723 -0.0011717 0.008754 0.0763079 0.0061706 0.1200674 -0.0019778 0.0205807 -0.0771972 0.0036336 -0.1398373 -0.1262111 -0.0230548 0.0021856 -0.0454573 0.0697961 0.0353015 0.0052714 -0.1102367 0.0016863 0.0860646 -0.0062806 -0.0331448 0.0186778 -0.113258 -0.0714034 0.1085094 0.0195 0.1705205 -0.0086812 -0.0062432 0.0159909 0.0172959 0.0701027 0.0047685 0.0158853 0.0956092 0.0373502 0.0840228 0.0341475 0.124475 -0.0047697 -0.0333935 0.0011974 0.027331 -0.1066143 0.0383565 0.0712047 -0.0285608 -0.1465279 0.0308922 -0.0318241 0.0385961 -0.1297177 -0.0014079 -0.0527174 -0.0926177 -0.0062619 -0.0128888 -0.0000551 0.1029122 0.0653968 -0.0105414 0.0547381 -0.04259 0.0274867 -0.0816125 -0.0056739 -0.107268 -0.0838419 0.0679018 0.011494 -0.0536992 -0.039667 -0.0571501 0.0965569 -0.0048163 0.120749 -0.0069742 -0.0500119 -0.0135641 -0.0011475 0.1187942 0.1191905 0.0003101 0.0168919 -0.0007087 0.1157383 unknown
polarizability: 111.788183|-4.0028427|91.5594824|0.1253229|2.7652107|60.6560899 unknown
InChI: InChI=1S/C8H12O/c1-5-4-8(9)7(3)6(5)2/h5H,4H2,1-3H3
charge 0 multiplicity 1
21 atoms
O  2.38802 -1.128797 -0.144997
C  -1.26522 -0.65378 -0.371425
C  -0.050116 -1.622274 -0.379669
C  -0.640856 0.725333 -0.123944
C  0.729124 0.673621 -0.013941
C  1.188286 -0.732566 -0.173625
C  -2.347215 -1.029423 0.673662
C  -1.496007 1.959996 -0.035454
C  1.708482 1.796085 0.219192
H  -1.752637 -0.643516 -1.369491
H  0.049507 -2.188928 -1.322712
H  -0.104133 -2.367018 0.436041
H  -2.757545 -2.03276 0.45944
H  -1.917534 -1.045835 1.692519
H  -3.189609 -0.313777 0.666557
H  -2.140857 1.93353 0.865279
H  -2.178493 2.032539 -0.904879
H  -0.89044 2.880208 0.010439
H  1.574073 2.259514 1.214477
H  1.607716 2.59729 -0.536238
H  2.735552 1.395557 0.166267
