program: Orca
programVersion: 4.2.1
elementType: Cl Cl O N N C C C C C C C C C C C C C C H H H H H H H H H H H H
charge: 0
multiplicity: 1
keywords: wb97x-d3
keywords: def2-TZVPP
keywords: def2/J RIJCOSX GRIDX6 NOFINALGRIDX
keywords: grid4 nofinalgrid
keywords: scfconv7
keywords: smallprint printgap noloewdin
keywords: NOSOSCF
formula: C14H12Cl2N2O
InChI: InChI=1S/C14H12Cl2N2O/c1-19-18-14(7-10-3-2-6-17-9-10)12-5-4-11(15)8-13(12)16/h2-6,8-9H,7H2,1H3
31 atoms
Cl 0.041602 0.106647 2.072741
Cl -4.587261 -2.08786 0.562268
O  3.258965 -0.838482 -0.307438
N  1.999032 -1.22505 0.021637
N  2.572937 3.523312 -0.424258
C  1.337076 0.263194 -1.843406
C  1.104119 -0.713326 -0.719156
C  -0.294483 -1.049052 -0.368237
C  1.327875 1.657949 -1.274699
C  -0.861642 -0.736053 0.866492
C  -1.106355 -1.674035 -1.312443
C  0.139842 2.310919 -0.967446
C  2.515077 2.320269 -0.979243
C  -2.180396 -1.052049 1.160025
C  -2.421751 -2.005728 -1.043448
C  -2.94516 -1.691137 0.200159
C  0.188738 3.564567 -0.381456
C  1.429296 4.126717 -0.125522
C  4.189265 -1.393039 0.603111
H  2.280594 0.06221 -2.350249
H  0.54427 0.159855 -2.585641
H  -0.69571 -1.919911 -2.283612
H  -0.815546 1.849213 -1.18723
H  3.465634 1.852421 -1.213034
H  -2.601776 -0.796734 2.122364
H  -3.024038 -2.500375 -1.792527
H  -0.716519 4.099304 -0.12812
H  1.502198 5.105458 0.335443
H  4.17105 -2.48527 0.589238
H  4.012646 -1.044836 1.623321
H  5.171214 -1.052277 0.279417
elementType: Cl O N C H
totalener: -1645.86117625 hartree
nucrepener: 1626.39794136 hartree
electener: -3272.25911761 hartree
oneelecener: -5488.70156709 hartree
twoeener: 2216.44244948 hartree
cpcmener: -0.02018563 hartree
kineticenergy: 1641.45496432 hartree
xcener: -112.968740989902 hartree
chargesum: -0.0000000
charge: -0.067335 -0.081597 -0.229298 -0.107801 -0.359773 -0.042421 0.116352 -0.014542 0.054970 -0.001789 -0.115594 -0.205628 -0.022152 -0.135698 -0.177509 0.103674 -0.134521 0.002168 -0.111773 0.098483 0.115208 0.149383 0.151040 0.118804 0.124694 0.146588 0.156676 0.145907 0.106706 0.103463 0.113315
qa: -0.0673 -0.0816 -0.2293 -0.1078 -0.3598 -0.0424 0.1164 -0.0145 0.0550 -0.0018 -0.1156 -0.2056 -0.0222 -0.1357 -0.1775 0.1037 -0.1345 0.0022 -0.1118 0.0985 0.1152 0.1494 0.1510 0.1188 0.1247 0.1466 0.1567 0.1459 0.1067 0.1035 0.1133
va: 1.2452 1.2223 1.9615 2.8998 3.0672 3.8185 3.8762 3.6511 3.5451 3.9576 3.9092 3.9821 4.0761 4.0568 4.0269 3.8700 3.8964 4.0013 3.8903 1.0344 1.0113 0.9998 0.9968 1.0230 1.0230 1.0050 0.9902 0.9980 0.9955 0.9950 0.9943
dispcorr: -0.016103891 hartree
energy: -1645.877280137747
dipole: 18.71934 -19.40803 -0.68869 5.80932 -6.37375 -0.56443 -9.78278 8.64402 -1.13876
magnitude: 1.44556 au
magnitude: 3.67433 debye
