program: Orca
programVersion: 4.2.1
elementType: Cl Cl O N N C C C C C C C C C C C C C C H H H H H H H H H H H H
charge: 0
multiplicity: 1
keywords: wb97x-d3
keywords: def2-TZVPP
keywords: def2/J RIJCOSX GRIDX6 NOFINALGRIDX
keywords: grid4 nofinalgrid
keywords: scfconv7
keywords: smallprint printgap noloewdin
keywords: NOSOSCF
formula: C14H12Cl2N2O
InChI: InChI=1S/C14H12Cl2N2O/c1-19-18-14(7-10-3-2-6-17-9-10)12-5-4-11(15)8-13(12)16/h2-6,8-9H,7H2,1H3
31 atoms
Cl -0.398802 -0.239503 -1.996083
Cl -4.541222 -1.971103 0.89988
O  3.292656 -0.897377 -0.287204
N  1.992865 -1.290667 -0.240807
N  2.416366 3.436054 -0.925577
C  1.75588 0.552354 1.399549
C  1.287328 -0.615549 0.569688
C  -0.152389 -0.958727 0.615732
C  1.535467 1.811717 0.603429
C  -0.994558 -0.833625 -0.488233
C  -0.716701 -1.38814 1.814804
C  0.287162 2.418336 0.529551
C  2.563677 2.372602 -0.147575
C  -2.344861 -1.142399 -0.409157
C  -2.057927 -1.709138 1.919251
C  -2.860469 -1.583277 0.796903
C  0.120845 3.525981 -0.284739
C  1.213951 3.993222 -0.996787
C  3.992868 -1.652248 -1.257451
H  1.182437 0.593388 2.326858
H  2.80541 0.447561 1.6723
H  -0.087688 -1.486027 2.690604
H  -0.547224 2.032419 1.103158
H  3.556412 1.936106 -0.112654
H  -2.982026 -1.033986 -1.275851
H  -2.46568 -2.050962 2.86015
H  -0.837027 4.02118 -0.367119
H  1.116095 4.857024 -1.644832
H  3.989567 -2.719446 -1.024107
H  5.019273 -1.290549 -1.239778
H  3.58319 -1.503612 -2.259139
elementType: Cl O N C H
totalener: -1645.86110168 hartree
nucrepener: 1630.40704703 hartree
electener: -3276.26814871 hartree
oneelecener: -5496.73146895 hartree
twoeener: 2220.46332024 hartree
cpcmener: -0.02023609 hartree
kineticenergy: 1641.45669123 hartree
xcener: -112.969103674458 hartree
chargesum: 0.0000000
charge: -0.066822 -0.081830 -0.230471 -0.107181 -0.358445 -0.044735 0.112360 -0.012184 0.054289 -0.001532 -0.116363 -0.208171 -0.021842 -0.138193 -0.177364 0.106663 -0.131493 0.001127 -0.111813 0.116481 0.100548 0.149160 0.150977 0.118834 0.125256 0.147021 0.156622 0.145497 0.106777 0.113497 0.103328
qa: -0.0668 -0.0818 -0.2305 -0.1072 -0.3584 -0.0447 0.1124 -0.0122 0.0543 -0.0015 -0.1164 -0.2082 -0.0218 -0.1382 -0.1774 0.1067 -0.1315 0.0011 -0.1118 0.1165 0.1005 0.1492 0.1510 0.1188 0.1253 0.1470 0.1566 0.1455 0.1068 0.1135 0.1033
va: 1.2463 1.2220 1.9603 2.8997 3.0675 3.8153 3.8779 3.6503 3.5444 3.9603 3.9100 3.9849 4.0768 4.0594 4.0264 3.8650 3.8937 4.0041 3.8900 1.0110 1.0351 1.0001 0.9973 1.0234 1.0227 1.0047 0.9900 0.9980 0.9953 0.9945 0.9953
dispcorr: -0.016258333 hartree
energy: -1645.877360007935
dipole: 20.22732 -20.59124 -0.36392 6.57148 -6.90546 -0.33398 4.05104 -2.64155 1.40949
magnitude: 1.49353 au
magnitude: 3.79626 debye
